program: Orca
programVersion: 5.0.4
elementType: C H H H
charge: 0
multiplicity: 2
keywords: SP F12/RI-CCSD(T) cc-pVTZ-F12 cc-pVTZ-F12-CABS cc-pVQZ/C VeryTightSCF
keywords: NoFrozenCore
formula: CH3
InChI: InChI=1/CH3/h1H3
4 atoms
C  -0.000097 0.000095 0.000062
H  1.015407 0.346221 0.091798
H  -0.507145 -0.413687 0.855101
H  -0.507102 0.066337 -0.94764
totalener: -39.58012254 hartree
nucrepener: 9.69707844 hartree
electener: -49.27720098 hartree
oneelecener: -71.62059140 hartree
twoeener: 22.34339042 hartree
kineticenergy: 39.55056173 hartree
s2: 0.761700
energy: -305.6741 -25.8096 -15.8319 -15.8266 -10.4615 1.8767 2.0557 2.0560 2.3339 5.6904 5.6913 5.7185 9.5782 9.5786 10.8799 11.4344 11.7111 11.7143 13.4051 13.4081 13.7607 15.6271 18.1324 18.1368 18.5576 21.0468 25.3957 25.4000 26.0315 26.0346 27.8900 27.8921 29.4083 37.0450 37.5903 37.7714 37.7740 39.8376 39.8400 41.6210 44.2455 47.9730 47.9855 48.8290 50.1612 51.3698 51.3705 51.7986 51.8061 52.4857 53.2708 53.2981 53.3023 58.4597 58.4627 60.1106 60.1115 62.8320 62.8325 64.4123 64.4242 65.8052 66.8564 72.9250 74.0910 78.3129 80.6709 80.6776 86.2439 86.2474 87.6907 87.7041 94.1323 98.2653 103.7513 103.7648 127.9893 127.9954 130.9130 131.4442 131.4475 142.1836 143.9567 144.9540 157.5694 157.5806 158.2302 158.2320 158.7845 161.7038 161.7058 177.8072 194.4356 194.4426 195.0356 221.0589 221.0680 224.5209 234.0613 234.0667 249.1203 249.1257 255.5331 559.7662 589.8610 589.8768 617.1007 electronvolt
energy: -305.0499 -23.3548 -15.4517 -15.4461 1.5732 2.0036 2.0724 2.0727 4.3834 5.7445 5.7453 6.0742 9.6546 9.6549 11.3948 12.2450 12.2481 13.5412 13.5439 13.7010 14.3852 15.5960 18.2259 18.2302 19.1509 22.0524 26.2636 26.2669 26.5382 26.5426 28.0438 28.0459 30.1790 37.0068 37.5646 38.1806 38.1831 40.4448 40.4472 42.9052 45.8737 47.8879 47.9005 48.9504 50.5008 51.6250 51.6257 51.9522 51.9598 52.9082 53.3710 53.3750 53.5045 58.5506 58.5533 60.9570 60.9581 62.9488 62.9494 64.5673 64.5792 65.8358 67.9375 73.2267 74.3900 78.3095 80.8286 80.8355 86.3465 86.3497 88.7787 88.7921 94.7081 98.8234 104.0143 104.0278 128.7178 128.7236 132.1810 132.5293 132.5326 142.3612 144.1781 146.3776 157.6506 157.6620 158.3351 158.3368 158.8902 161.6769 161.6796 177.7366 194.5683 194.5753 195.3056 222.1090 222.1179 225.4278 234.2072 234.2133 249.1714 249.1776 255.6826 560.4506 590.0548 590.0705 617.4962 electronvolt
corrType: UHF
chargesum: 0.0000000
charge: -0.332773 0.110883 0.110985 0.110904
charge: 0.602711 -0.200924 -0.200929 -0.200859
qa: -0.3328 0.1109 0.1110 0.1109
va: 3.9707 1.0331 1.0331 1.0331
energy: -39.827913046021 hartree
dipole: 0.00109 -0.00084 0.00025 -0.00106 0.00059 -0.00047 -0.00070 0.00054 -0.00016
magnitude: 0.00055 au
magnitude: 0.00139 debye
dipolemethod: MDCI
