program: Orca
programVersion: 5.0.4
elementType: C H H H
charge: 0
multiplicity: 2
keywords: SP M062X 6-311++G(2d,2p) def2-TZVP/C def2/J TightSCF
formula: CH3
InChI: InChI=1/CH3/h1H3
4 atoms
C  -0.000097 0.000095 0.000062
H  1.015407 0.346221 0.091797
H  -0.507145 -0.413687 0.855101
H  -0.507102 0.066337 -0.94764
totalener: -39.82323742 hartree
nucrepener: 9.69707835 hartree
electener: -49.52031577 hartree
oneelecener: -71.66664469 hartree
twoeener: 22.14632892 hartree
kineticenergy: 39.65208948 hartree
xcener: -3.110954472417 hartree
s2: 0.754727
energy: -286.9151 -21.1991 -13.3862 -13.3816 -7.8111 0.1105 0.9507 0.9513 2.4746 2.9265 2.9280 4.1738 5.0076 6.0233 6.0240 12.3167 12.3218 14.1887 15.5975 16.1566 16.1603 16.8961 16.8983 18.6665 23.7938 25.3320 27.1164 27.1256 27.7299 30.1657 30.1746 36.8901 36.9014 39.8438 39.8453 42.4226 71.4061 71.6109 71.6111 75.1230 84.3679 84.3715 86.3406 86.3508 87.6358 98.0813 98.0867 103.8820 106.5435 107.6782 107.6857 109.2323 109.2390 120.5051 133.5954 133.6188 653.4755 electronvolt
energy: -286.7276 -19.8927 -13.0361 -13.0299 -1.2043 0.3575 1.2261 1.2267 2.8133 2.8148 2.9670 3.4282 5.4268 6.2044 6.2048 12.2715 12.2778 14.8976 15.6558 16.7856 16.7888 17.1506 17.1537 18.4030 23.8297 25.6412 26.6973 26.7074 26.9450 30.1524 30.1623 37.0274 37.0405 40.2380 40.2419 43.3357 71.3583 71.7800 71.7922 76.9838 86.8623 86.8963 87.6153 87.6500 90.9541 98.7010 98.7099 104.6714 107.1394 109.1459 109.1949 110.0164 110.0215 123.3077 135.8874 135.9649 653.8210 electronvolt
chargesum: -0.0000000
charge: -0.376634 0.125458 0.125563 0.125612
charge: 0.157689 -0.052571 -0.052587 -0.052530
qa: -0.3766 0.1255 0.1256 0.1256
va: 3.8740 0.9776 0.9776 0.9777
energy: -39.823237419977 hartree
dipole: 0.00109 -0.00089 0.00019 -0.00106 0.00060 -0.00046 -0.00070 0.00048 -0.00022
magnitude: 0.00054 au
magnitude: 0.00138 debye
