program: Gaussian 09
title: 000070677
version: EM64L-G09RevD.01
frameworkgroup: C1[X(C19H6F6O6)]
method: RPBEPBE
basis: SDD
operation: Freq
keyword: #p
keyword: freq=noraman
keyword: PBEPBE/SDD
title: #p freq=noraman PBEPBE/SDD
converged: YES YES NO NO
title: Mulliken charges:
elementType: F F F F F F O O O O O O C C C C C C C C C C C C C C C C C C C H H H H H H
charge: -0.117845 -0.139619 -0.132109 -0.139775 -0.117766 -0.132143 -0.221663 -0.221670 -0.143640 -0.143605 -0.143189 -0.143207 -0.263753 0.437338 0.436860 0.356697 0.356722 -0.486984 -0.485911 -0.323806 -0.324210 0.139365 0.139176 0.140318 0.140345 -0.373755 -0.373608 0.126983 0.126982 0.144065 0.144026 0.302089 0.302031 0.283963 0.283881 0.283710 0.283706
chargesum: 0.00000
title: Mulliken charges with hydrogens summed into heavy atoms:
elementType: F F F F F F O O O O O O C C C C C C C C C C C C C C C C C C C
charge: -0.117845 -0.139619 -0.132109 -0.139775 -0.117766 -0.132143 -0.221663 -0.221670 -0.143640 -0.143605 -0.143189 -0.143207 -0.263753 0.437338 0.436860 0.356697 0.356722 -0.184895 -0.183880 -0.039843 -0.040329 0.139365 0.139176 0.140318 0.140345 -0.090045 -0.089901 0.126983 0.126982 0.144065 0.144026
polarizability: 3.15833095e+02 -3.83049685e-02 2.10923041e+02 -2.12754650e+01 -2.88163060e-02 1.60496630e+02
1716.lowfreq: -5.0607 -2.3527 -0.0006 0.0002 0.0004 3.5164 21.4117 25.3665 37.2037
frequency: 21.4002 25.3365 37.2002 48.8895 67.3924 89.1142 92.8762 107.9935 132.1506 136.1073 144.0998 152.0023 158.5781 159.4743 174.7731 175.7419 189.2528 221.4292 260.4722 269.4335 273.4318 298.1164 298.5990 319.3458 320.9113 343.1209 348.1520 354.7650 413.0812 416.4676 455.4866 467.7041 475.5456 489.0867 501.8065 526.2778 529.3554 535.2746 551.8722 573.1923 597.6343 601.8568 619.6687 636.4613 651.0220 659.5136 671.1665 672.0894 701.5767 705.6945 729.2061 729.7937 762.7012 762.7420 779.0543 779.1401 801.3258 839.4306 854.1360 868.7033 895.3021 919.1567 933.1826 941.2363 955.7578 987.3366 993.1025 999.0414 1023.3434 1035.7210 1039.5325 1070.4413 1073.5806 1083.1425 1097.3728 1122.7532 1135.1875 1160.3486 1164.0446 1208.1368 1213.0628 1238.8011 1239.3784 1297.5557 1298.6432 1378.2366 1387.4384 1435.0035 1435.1750 1481.7880 1482.5108 1609.4084 1611.6600 1623.6164 1625.9292 1699.9375 1700.1149 1753.2783 1755.8096 3159.0454 3159.5857 3177.7574 3177.9966 3188.2366 3189.6478
redmass: 9.8593 11.8189 11.3166 13.0379 17.5235 17.4489 16.8069 12.0237 7.4341 7.7306 12.1921 12.1033 12.0910 11.3536 8.8548 7.7438 12.0615 13.5379 16.7924 14.7029 12.8927 7.2706 15.5433 6.9120 6.8276 8.0032 10.3829 11.0480 3.1630 3.1940 16.6736 17.0190 13.9478 16.5372 7.9769 9.0055 8.3055 7.9272 9.8728 8.8211 13.5454 11.5807 12.2717 12.2803 9.3354 11.2165 4.2915 4.2307 9.1162 8.4378 7.3708 7.3310 6.1614 6.1569 13.3925 13.2789 8.8462 5.6217 1.7584 1.6790 3.8231 3.0434 1.7686 1.8580 5.5224 2.9492 1.3841 1.9463 10.0011 7.5705 5.7882 4.7813 6.2839 5.1181 4.9901 5.9152 3.4487 2.7637 2.3235 1.8682 1.9996 6.0874 5.8359 1.3411 1.3461 7.8723 7.7705 3.9470 3.9547 2.5187 2.5601 8.2598 8.4659 7.2919 7.2325 13.1090 13.1082 12.9977 12.9889 1.0894 1.0892 1.0973 1.0971 1.0935 1.0935
irintensity: 1.8904 1.7302 0.0806 3.0225 0.0312 0.0803 0.0472 1.0427 1.8970 1.2536 2.8072 4.5044 3.0054 0.5022 0.5930 0.0115 4.5467 1.7953 1.9043 0.7111 0.1740 0.0968 0.5662 1.2151 0.2647 1.6299 24.7379 0.1384 0.8187 0.1080 4.3535 2.6415 0.7317 0.6688 4.0106 8.5540 5.9593 2.6167 11.2310 33.1698 3.0880 7.5570 26.7583 19.6669 1.5962 2.1596 63.9196 26.0281 6.2854 3.6768 2.8314 5.1316 0.7400 0.0621 229.5336 148.7537 44.5775 1.1660 68.1180 37.1485 48.3936 34.9950 6.6658 7.6959 6.2414 28.1990 0.0112 3.0390 3.5195 34.0195 396.5782 301.4974 111.6134 0.0843 41.4167 137.8007 175.3267 93.2689 67.9643 1.8644 18.2074 301.6092 12.7019 0.3517 1.9478 0.2960 1.7350 14.2710 12.3222 18.4119 8.3003 0.2127 0.8078 7.1191 4.5413 335.9333 541.7049 417.2334 15.4567 2.6432 0.1144 2.8996 0.3325 3.8989 3.8468
temp: 298.150 k
press: 1.00000 atm
elementType: 9 9 9 9 9 9 8 8 8 8 8 8 6 6 6 6 6 6 6 6 6 6 6 6 6 6 6 6 6 6 6 1 1 1 1 1 1
symmnumber: 1
zpe: 560663.2 jmol-1
zpe.correction: 0.213545 hartree
zpe.thermalcorrener: 0.238916 hartree
zpe.thermalcorrenthalpy: 0.239860 hartree
zpe.thermalcorrgfe: 0.157387 hartree
zpe.sumelectzpe: -1775.880590 hartree
zpe.sumelectthermal: -1775.855219 hartree
zpe.sumelectthermalent: -1775.854275 hartree
zpe.sumelectthermalfe: -1775.936748 hartree
dipole: 0.0045 -0.7545 0.0039
dipole: 0.7545
quadrupole: -254.6754 -186.7053 -176.8356
quadrupole: 0.0067 7.8904 0.0032
quadrupole: -48.6033 19.3668 29.2365 0.0067 7.8904 0.0032
hfenergy: -1776.0941349 hartree
pointgroup: C01 [X(C19H6F6O6)]
dipole: -0.0043721 0.2968235 0.0004615 debye
polarizability: 315.291698|0.9507775|210.9312734|23.1329942|0.0553262|161.0297935 unknown
InChI: InChI=1S/C19H6F6O6/c20-18(21,22)17(19(23,24)25,7-1-3-9-11(5-7)15(28)30-13(9)26)8-2-4-10-12(6-8)16(29)31-14(10)27/h1-6H
charge 0 multiplicity 1
37 atoms
F  -1.179062 -2.658738 1.528046
F  0.360871 -1.275424 2.431748
F  1.01699 -3.064028 1.206589
F  -0.339783 -1.298018 -2.420409
F  1.223654 -2.646926 -1.506583
F  -0.964696 -3.090717 -1.183513
O  -5.754127 1.222239 -0.26592
O  5.72544 1.32519 0.25792
O  -5.486164 -0.684042 -1.626634
O  5.492643 -0.579988 1.626636
O  -5.295973 2.9847 1.23141
O  5.2348 3.072949 -1.246352
C  0.007405 -1.122866 0.004907
C  -1.28181 -0.261586 0.139403
C  1.279163 -0.237952 -0.135859
C  0.053767 -2.038462 1.281408
C  -0.020387 -2.04807 -1.264681
C  -2.495909 -0.594559 -0.514439
C  2.499759 -0.547009 0.518107
C  -1.232134 0.859398 1.018734
C  1.209229 0.877312 -1.020666
C  -3.607809 0.227956 -0.280812
C  3.596923 0.293518 0.279583
C  -3.551287 1.338892 0.584422
C  3.519979 1.39955 -0.5905
C  -2.363593 1.671266 1.254377
C  2.326188 1.707777 -1.26111
C  -4.987696 0.122043 -0.838303
C  4.97912 0.214037 0.835748
C  -4.89154 1.993776 0.618977
C  4.848476 2.077761 -0.629155
H  -2.595334 -1.456823 -1.177214
H  2.614392 -1.40482 1.184458
H  -0.295058 1.09802 1.530032
H  0.267818 1.096424 -1.532803
H  -2.317131 2.525798 1.935347
H  2.264275 2.558024 -1.946197
