program: Orca
programVersion: 5.0.4
elementType: C H H H
charge: 0
multiplicity: 2
keywords: SP M062X aug-cc-pVDZ def2-TZVP/C def2/J TightSCF
keywords: NoFrozenCore
formula: CH3
InChI: InChI=1/CH3/h1H3
4 atoms
C  -0.000097 0.000095 0.000062
H  1.015407 0.346221 0.091798
H  -0.507145 -0.413687 0.855101
H  -0.507103 0.066337 -0.94764
totalener: -39.81078788 hartree
nucrepener: 9.69707837 hartree
electener: -49.50786626 hartree
oneelecener: -71.62515376 hartree
twoeener: 22.11728751 hartree
kineticenergy: 39.52623550 hartree
xcener: -3.105508144537 hartree
s2: 0.754717
energy: -287.2934 -21.1798 -13.3366 -13.3316 -7.7500 -0.0249 0.6950 0.6956 2.1495 2.8983 2.9001 3.6869 5.6550 5.6563 5.9306 8.1311 8.1331 9.9740 9.9754 11.2152 11.8878 12.2774 13.1288 13.5829 13.5839 14.8823 14.8864 15.0054 15.0069 20.8501 21.3126 25.9971 25.9988 34.4890 34.4992 36.5505 36.5511 42.2667 44.1401 47.4551 48.0156 48.0237 51.2193 55.1084 55.1210 60.3933 60.4085 68.7498 73.4089 73.4207 electronvolt
energy: -287.1093 -19.8889 -12.9803 -12.9745 -1.1508 0.3297 1.0867 1.0870 2.9085 2.9107 3.1644 3.1766 5.4734 5.8181 5.8194 7.4743 7.4765 10.0843 10.0866 11.3802 11.5477 11.6507 12.6915 12.6934 13.0244 13.8772 13.8805 15.0758 15.0786 20.3892 21.5514 26.1476 26.1493 34.5128 34.5278 36.8873 36.8915 42.8170 44.5615 48.0454 48.4264 48.4366 52.3933 55.7309 55.7447 60.8809 60.8941 69.4757 74.3989 74.4273 electronvolt
chargesum: -0.0000000
charge: 0.781506 -0.260959 -0.261146 -0.259401
charge: 0.338386 -0.112825 -0.112824 -0.112737
qa: 0.7815 -0.2610 -0.2611 -0.2594
va: 3.7814 0.7205 0.7200 0.7191
energy: -39.810787882491 hartree
dipole: 0.00109 -0.00097 0.00012 -0.00106 0.00074 -0.00032 -0.00070 0.00035 -0.00034
magnitude: 0.00049 au
magnitude: 0.00124 debye
