program: Orca
programVersion: 5.0.4
elementType: C H H H
charge: 0
multiplicity: 2
keywords: Opt RIJCOSX PBEh-3c
formula: CH3
InChI: InChI=1/CH3/h1H3
4 atoms
C  -5.59209 1.965156 -0.064623
H  -4.576586 2.311282 0.027112
H  -6.099138 1.551374 0.790416
H  -6.099095 2.031398 -1.012325
totalener: -39.71025539 hartree
nucrepener: 10.38660854 hartree
electener: -50.09686393 hartree
oneelecener: -72.86282177 hartree
twoeener: 22.76595784 hartree
kineticenergy: 39.78896772 hartree
exchangeener: -3.492364876384 hartree
correlationener: -0.352837304079 hartree
xcener: -3.845202180463 hartree
s2: 0.754004
dispersion: -0.000483736 hartree
s2: 0.754551
dispersion: -0.000482237 hartree
s2: 0.754623
dispersion: -0.000482045 hartree
s2: 0.754723
dispersion: -0.000481874 hartree
s2: 0.754702
dispersion: -0.000481905 hartree
s2: 0.754674
dispersion: -0.000481945 hartree
s2: 0.754663
dispersion: -0.000481960 hartree
s2: 0.754662
energy: -284.2251 -20.9671 -12.9951 -12.9902 -7.7164 4.5337 6.2541 6.2580 13.5325 13.5356 14.3466 20.0009 28.3528 28.8843 28.8927 46.3759 46.3810 56.7296 61.1500 61.1724 368.1199 electronvolt
energy: -283.7873 -19.5218 -12.6699 -12.6648 -0.3852 5.0896 6.4306 6.4344 13.8655 13.8683 16.9654 21.0078 29.0155 29.0239 29.1950 48.3568 48.3609 58.9137 61.4802 61.5025 368.7513 electronvolt
chargesum: -0.0000000
charge: -0.662126 0.220675 0.220717 0.220733
charge: -0.392196 0.130695 0.130748 0.130753
qa: -0.6621 0.2207 0.2207 0.2207
va: 3.7933 0.9248 0.9248 0.9248
dispersion: -0.000481961 hartree
energy: -39.748127753391 hartree
dipole: 0.00109 -0.00082 0.00026 -0.00106 0.00050 -0.00055 -0.00070 0.00045 -0.00025
magnitude: 0.00066 au
magnitude: 0.00168 debye
