program: Orca
programVersion: 5.0.4
elementType: C H H H
charge: 0
multiplicity: 2
keywords: SP r2SCAN-3C def2-QZVP def2-TZVP/C def2/J TightSCF
keywords: NoFrozenCore
formula: CH3
InChI: InChI=1/CH3/h1H3
4 atoms
C  -0.000097 0.000095 0.000062
H  1.015407 0.346221 0.091797
H  -0.507145 -0.413687 0.855101
H  -0.507102 0.066337 -0.94764
totalener: -39.83163112 hartree
nucrepener: 9.69707835 hartree
electener: -49.52870947 hartree
oneelecener: -71.70990593 hartree
twoeener: 22.18119646 hartree
kineticenergy: 39.63760417 hartree
exchangeener: -6.229090849628 hartree
correlationener: -0.245731016671 hartree
xcener: -6.474821866299 hartree
s2: 0.755127
energy: -273.3425 -17.8890 -10.6249 -10.6203 -5.8637 1.3011 3.2947 3.2951 4.2251 4.2261 4.6488 6.2651 9.5653 9.5697 9.8042 11.2289 11.2308 17.2357 17.2404 17.7498 18.1184 20.3123 22.0305 22.0316 22.4932 22.6137 22.6217 24.4896 26.7637 26.7671 31.6549 34.1617 34.1669 36.3218 36.3238 46.0664 46.0700 47.5080 49.4002 51.8545 51.8619 52.8716 52.8782 53.6219 54.2973 57.6519 59.3291 59.3382 65.9331 65.9357 67.5611 68.9644 68.9671 69.2827 72.3000 72.3010 72.8315 76.4676 76.4682 77.5691 79.4910 80.8018 80.8159 86.8007 92.3420 92.3467 96.5896 96.5945 98.5045 101.2090 106.2356 106.2445 109.3066 109.3385 115.6185 142.1459 144.0191 144.0367 145.4981 146.5979 146.6038 154.5909 154.6008 155.6063 155.8105 161.0378 161.0541 164.2627 165.1758 169.4853 169.4932 169.5382 171.4045 171.4176 178.6889 178.6905 178.7550 182.8963 187.2890 187.3045 189.0461 189.0718 191.7845 199.6985 199.7170 204.0552 204.0961 209.6559 209.6611 209.8067 212.1723 212.1757 213.2990 214.0458 214.0545 215.6040 224.3638 229.5019 229.5274 231.1244 231.9016 232.4817 232.4832 232.7878 232.7907 233.9631 238.8033 238.8055 247.4719 250.4803 254.0933 257.4491 257.4994 267.5146 267.5842 273.9589 279.2525 279.2635 281.1683 292.4485 311.8364 311.9061 320.3754 320.4386 374.3517 787.4121 4041.8880 electronvolt
energy: -272.9096 -16.6476 -10.3447 -10.3400 -2.3671 2.0893 4.0407 4.0417 4.8254 4.8286 5.7094 7.5119 11.4515 11.4536 11.9932 12.0539 12.0561 17.7187 17.7232 18.0923 18.3922 21.2694 23.0327 23.0348 23.0671 23.0747 23.4848 24.2185 27.3926 27.3950 32.9678 34.4270 34.4340 37.2806 37.2832 46.7727 46.7766 48.0593 49.8538 51.9439 51.9506 53.1418 53.1478 54.0117 54.5975 57.2047 59.8789 59.8890 65.5537 65.5565 67.3148 69.0627 69.0663 69.3801 71.6922 71.6932 73.1114 76.8103 76.8116 77.1075 79.0993 80.3372 80.3530 87.1583 91.8501 91.8560 96.5764 96.5865 98.6207 100.9417 105.6013 105.6101 108.7204 108.7512 115.2984 141.4396 143.5984 143.6174 144.8460 146.5780 146.5879 154.4860 154.4969 154.8185 155.4202 161.1498 161.1659 163.4068 163.9506 167.4156 167.6153 167.6221 169.7580 169.7721 177.9257 177.9268 178.0072 181.5117 187.6964 187.7254 187.9557 187.9709 192.0096 197.7949 197.8136 201.9557 201.9965 207.8569 207.8663 207.8855 210.5816 210.5847 210.8260 212.3251 212.3346 213.2419 222.1660 228.0986 228.1170 229.2279 229.5722 230.2587 230.2620 230.3163 230.3227 232.6311 236.3307 236.3357 245.0424 248.2907 251.9145 255.6010 255.6488 265.5923 265.6607 272.2622 277.0390 277.0527 278.5291 290.4070 309.8216 309.8924 318.3527 318.4125 371.8749 786.3951 4041.6156 electronvolt
chargesum: -0.0000000
charge: -0.135867 0.045191 0.045411 0.045265
charge: 0.419263 -0.139759 -0.139792 -0.139712
qa: -0.1359 0.0452 0.0454 0.0453
va: 3.8583 1.0138 1.0138 1.0138
dispersion: -0.000209897 hartree
energy: -39.830471319771 hartree
dipole: 0.00109 -0.00085 0.00024 -0.00106 0.00059 -0.00047 -0.00070 0.00052 -0.00018
magnitude: 0.00056 au
magnitude: 0.00142 debye
