program: Orca
programVersion: 6.0.0
elementType: C H H H
charge: 0
multiplicity: 2
keywords: Opt RIJCOSX PBEh-3c
formula: CH3
InChI: InChI=1/CH3/h1H3
4 atoms
C  -5.591988 1.964913 -0.064627
H  -4.5766 2.31138 0.027068
H  -6.099222 1.551437 0.790418
H  -6.0991 2.03148 -1.012279
totalener: -39.71025707046534 hartree
nucrepener: 10.38660854345507 hartree
electener: -50.09686561392041 hartree
oneelecener: -72.86281287382604 hartree
twoeener: 22.76594725990564 hartree
kineticenergy: 39.78898664287593 hartree
exchangeener: -3.492364074809 hartree
correlationener: -0.352837286064 hartree
xcener: -3.845201360873 hartree
s2: 0.754005
dispersion: -0.000483736 hartree
s2: 0.754551
dispersion: -0.000482237 hartree
s2: 0.754624
dispersion: -0.000482045 hartree
s2: 0.754724
dispersion: -0.000481874 hartree
s2: 0.754702
dispersion: -0.000481905 hartree
s2: 0.754674
dispersion: -0.000481945 hartree
s2: 0.754664
dispersion: -0.000481960 hartree
s2: 0.754663
energy: -284.2252 -20.9671 -12.9953 -12.9899 -7.7170 4.5338 6.2541 6.2585 13.5360 13.5364 14.3482 20.0004 28.3531 28.8840 28.8941 46.3776 electronvolt
energy: -283.7874 -19.5217 -12.6701 -12.6646 -0.3853 5.0898 6.4306 6.4349 13.8685 13.8689 16.9663 21.0077 29.0151 29.0253 29.1948 electronvolt
chargesum: 0.0000000
charge: -0.662158 0.220694 0.220768 0.220696
charge: -0.392212 0.130707 0.130770 0.130734
qa: -0.6622 0.2207 0.2208 0.2207
va: 3.7934 0.9248 0.9248 0.9248
dispersion: -0.000481961 hartree
energy: -39.748129300502 hartree
dipole: 0.000779602 -0.000605930 0.000173671 -0.000331773 0.000088902 -0.000242871 -0.000682977 0.000556770 -0.000126208
dipolemethod: SCF
magnitude: 0.000324155 au
magnitude: 0.000823936 debye
