program: Orca
programVersion: 6.0.0
elementType: C H H H
charge: 0
multiplicity: 2
keywords: SP revDSD-PBEP86-D4/2021 def2-QZVP def2-TZVP/C def2/J TightSCF
keywords: NoFrozenCore
formula: CH3
InChI: InChI=1/CH3/h1H3
4 atoms
C  -0.00007 0.00003 0.000061
H  1.015318 0.346497 0.091756
H  -0.507304 -0.413447 0.855107
H  -0.507183 0.066596 -0.947591
totalener: -39.68462450124762 hartree
nucrepener: 9.69708078990815 hartree
electener: -49.38174670151743 hartree
oneelecener: -71.65416454659079 hartree
twoeener: 22.27241784507336 hartree
kineticenergy: 39.57406106833326 hartree
exchangeener: -1.913184154778 hartree
correlationener: -0.120412845982 hartree
xcener: -2.033597000760 hartree
s2: 0.758182
energy: -294.5036 -23.1681 -14.2296 -14.2240 -8.9896 2.2777 4.0889 4.0897 5.0469 5.0486 5.1982 8.0821 11.6061 11.8817 11.8872 13.6010 electronvolt
energy: -293.9721 -21.2325 -13.8813 -13.8755 0.9015 2.4770 4.1722 4.1730 5.0809 5.0828 7.0305 8.8656 12.0605 12.0661 12.2055 electronvolt
chargesum: 0.0000000
charge: -0.288129 0.096250 0.096137 0.095742
charge: 0.416089 -0.138697 -0.138743 -0.138648
qa: -0.2881 0.0962 0.0961 0.0957
va: 3.8920 1.0023 1.0024 1.0026
total: -39.789274380 hartree
dispersion: -0.000480370 hartree
energy: -39.789754749956 hartree
dipole: 0.000779609 -0.000581394 0.000198216 -0.000331772 0.000072266 -0.000259507 -0.000682971 0.000704251 0.000021279
dipolemethod: SCF
magnitude: 0.000327240 au
magnitude: 0.000831778 debye
