program: Orca
programVersion: 6.0.0
elementType: C H H H
charge: 0
multiplicity: 2
keywords: Freq RIJCOSX PBEh-3c
frequency: 0.00 0.00 0.00 0.00 0.00 0.00 489.81 1453.39 1454.33 3216.94 3404.73 3405.84
frequency: 489.81 1453.39 1454.33 3216.94 3404.73 3405.84
formula: CH3
InChI: InChI=1/CH3/h1H3
4 atoms
C  -5.591988 1.964913 -0.064627
H  -4.5766 2.31138 0.027068
H  -6.099222 1.551437 0.790418
H  -6.0991 2.03148 -1.012279
totalener: -39.74849369715746 hartree
nucrepener: 9.69708078733580 hartree
electener: -49.44557448449326 hartree
oneelecener: -71.67453497798454 hartree
twoeener: 22.22896049349127 hartree
kineticenergy: 39.44560525969983 hartree
exchangeener: -3.448261693359 hartree
correlationener: -0.349446115584 hartree
xcener: -3.797707808943 hartree
s2: 0.754664
energy: -284.2145 -20.9636 -12.9924 -12.9871 -7.7127 4.5352 6.2555 6.2599 13.5382 13.5387 14.3519 20.0022 28.3560 28.8864 28.8966 46.3822 electronvolt
energy: -283.7768 -19.5185 -12.6674 -12.6619 -0.3822 5.0911 6.4320 6.4363 13.8709 13.8713 16.9702 21.0096 29.0175 29.0277 29.1976 electronvolt
chargesum: 0.0000000
charge: -0.662167 0.220696 0.220772 0.220699
charge: -0.392211 0.130706 0.130770 0.130734
qa: -0.6622 0.2207 0.2208 0.2207
va: 3.7934 0.9248 0.9248 0.9248
dispersion: -0.000481961 hartree
energy: -39.748129159798 hartree
dipole: 0.000779609 -0.000608667 0.000170942 -0.000331772 0.000084051 -0.000247721 -0.000682986 0.000556242 -0.000126744
dipolemethod: SCF
magnitude: 0.000326575 au
magnitude: 0.000830088 debye
temp: 298.15 k
press: 1.00 atm
zeropoint: 0.03058448 hartree
thermalvibcorrection: 0.00024368 hartree
thermalrotcorrection: 0.00141627 hartree
thermaltrasncorrection: 0.00141627 hartree
thermaltotal: -39.71446846 hartree
thermalcorr: 0.00307622 hartree
nonthermalcorr: 0.03058448 hartree
totalcorr: 0.03366070 hartree
thermalcorrenthalpy: 0.00094421 hartree
totalenthalpy: -39.71352425 hartree
vibrat: 0.00033913 hartree
rotat: 0.00663246 hartree
transl: 0.01618771 hartree
total: 0.02381375 hartree
totalentropycorr: -0.02381375 hartree
gibbsenthalpy: -39.73733800 hartree
gibbsminuselec: 0.01079116 hartree
