program: Orca
programVersion: 5.0.4
elementType: C H H H
charge: 0
multiplicity: 2
keywords: SP revPBE0 def2-QZVP def2-TZVP/C def2/J TightSCF
keywords: NoFrozenCore
formula: CH3
InChI: InChI=1/CH3/h1H3
4 atoms
C  -0.000097 0.000095 0.000062
H  1.015407 0.346221 0.091798
H  -0.507145 -0.413687 0.855101
H  -0.507103 0.066337 -0.94764
totalener: -39.84308980 hartree
nucrepener: 9.69707837 hartree
electener: -49.54016817 hartree
oneelecener: -71.70153931 hartree
twoeener: 22.16137114 hartree
kineticenergy: 39.64187956 hartree
exchangeener: -4.672029409487 hartree
correlationener: -0.259716150706 hartree
xcener: -4.931745560193 hartree
s2: 0.755012
energy: -278.7111 -19.3560 -11.8349 -11.8302 -6.8084 1.0509 2.8529 2.8533 3.8287 3.8305 3.9754 6.4457 9.6829 9.6998 9.7046 11.4905 11.4924 16.9662 16.9935 16.9978 17.5679 19.9464 21.0369 21.0380 21.4494 21.4866 21.4935 23.3915 25.6909 25.6937 30.4894 32.1175 32.1211 34.9439 34.9451 45.2984 45.3018 45.9133 47.6509 50.5613 50.5677 50.9834 50.9895 51.6490 52.5690 55.3786 57.3350 57.3445 62.8796 62.8818 65.1566 66.0436 66.1824 66.1851 68.8770 68.8787 70.5092 72.8286 72.8294 73.8141 75.8425 76.7748 76.7880 83.6379 88.7917 88.7971 92.5598 92.5641 95.0979 97.4500 102.4538 102.4560 105.6396 105.6616 110.3971 137.6888 139.7479 139.7664 140.6715 142.6784 142.6853 150.0284 150.0383 150.8240 151.5612 156.4407 156.4570 159.2712 160.1552 162.1840 162.4803 162.4859 164.7566 164.7700 173.2088 173.6380 173.6386 175.7531 182.3663 182.3929 182.4241 182.4380 186.8270 192.4176 192.4356 195.6014 195.6430 200.7207 200.7286 202.2519 204.2847 204.8993 204.9033 205.6416 205.6494 207.0053 216.4383 221.3558 222.1044 222.9046 222.9146 224.0348 224.0370 224.6668 224.6807 227.4053 229.6735 229.6746 237.8099 240.8652 245.5604 248.5327 248.5663 258.2758 258.3258 266.0585 269.2442 269.2552 271.5496 282.6764 301.7568 301.8315 309.8983 309.9477 363.5271 783.0512 4024.5971 electronvolt
energy: -278.3178 -18.0878 -11.5562 -11.5514 -1.4793 1.2728 2.9422 2.9426 3.9056 3.9073 5.2097 7.3465 9.8724 9.8772 10.1776 12.3337 12.3356 17.1144 17.1187 17.4984 17.8450 20.8477 21.5714 21.5723 21.9224 21.9297 23.0706 23.7345 25.7405 25.7433 30.9961 32.4232 32.4264 35.1255 35.1268 46.4936 46.4973 47.4108 47.6592 50.8541 50.8610 51.7370 51.7432 53.1202 53.1988 55.5281 58.2352 58.2460 63.1112 63.1136 65.7213 66.5973 66.6001 66.6043 68.8142 68.8157 71.9401 73.0319 73.0322 73.7334 75.8666 77.2330 77.2463 84.6980 88.8982 88.9035 93.6134 93.6176 96.2351 98.5423 102.7187 102.7206 105.8639 105.8826 110.6647 139.0984 140.4139 140.4326 141.1502 144.0467 144.0542 150.9627 150.9730 151.5103 152.5075 157.7781 157.7953 159.9233 160.5026 162.1373 162.7280 162.7325 164.8745 164.8885 173.7731 173.9395 173.9406 176.0993 182.6438 182.6724 184.0713 184.0845 188.9874 192.5668 192.5828 195.8067 195.8478 200.6044 200.6119 202.4862 204.2587 205.2562 205.2592 205.9841 205.9922 207.5621 216.5847 221.2580 222.0203 222.9820 222.9893 223.9742 223.9764 224.6065 224.6235 227.7523 229.7662 229.7675 237.9276 241.2286 245.4241 248.5528 248.5854 258.2088 258.2573 266.1026 269.7897 269.8011 272.6242 282.7077 301.9322 302.0106 310.0050 310.0513 363.9563 783.8461 4024.7808 electronvolt
chargesum: 0.0000000
charge: -0.235419 0.078503 0.078509 0.078406
charge: 0.418125 -0.139374 -0.139410 -0.139340
qa: -0.2354 0.0785 0.0785 0.0784
va: 3.8517 1.0094 1.0095 1.0095
energy: -39.843089796808 hartree
dipole: 0.00109 -0.00082 0.00027 -0.00106 0.00058 -0.00048 -0.00070 0.00059 -0.00011
magnitude: 0.00056 au
magnitude: 0.00142 debye
