program: Gaussian 09
title: 000070581
version: EM64L-G09RevD.01
frameworkgroup: C1[X(C18H16N2O2)]
method: RPBEPBE
basis: SDD
operation: Freq
keyword: #p
keyword: freq=noraman
keyword: PBEPBE/SDD
title: #p freq=noraman PBEPBE/SDD
converged: YES YES NO NO
title: Mulliken charges:
elementType: O O N N C C C C C C C C C C C C C C C C C C H H H H H H H H H H H H H H H H
charge: -0.191907 -0.220796 -0.428589 -0.405804 -0.137244 0.318415 0.413411 0.337077 0.273730 -0.657869 -0.648156 -0.406827 0.156260 -0.379781 -0.338191 0.149119 -0.392872 -0.396421 -0.258688 -0.280123 -0.252645 -0.256710 0.283658 0.223749 0.249628 0.221412 0.218668 0.221192 0.332601 0.265057 0.243357 0.348266 0.237650 0.236242 0.229883 0.232369 0.229061 0.231815
chargesum: 0.00000
title: Mulliken charges with hydrogens summed into heavy atoms:
elementType: O O N N C C C C C C C C C C C C C C C C C C
charge: -0.191907 -0.220796 -0.095988 -0.057537 -0.137244 0.318415 0.413411 0.337077 0.273730 -0.150461 -0.177115 0.033034 0.156260 -0.114724 -0.094833 0.149119 -0.155222 -0.160179 -0.028805 -0.047754 -0.023585 -0.024895
polarizability: 2.41027557e+02 -3.11012255e+00 2.22463788e+02 -8.96688879e+00 -8.30245939e+00 1.43697643e+02
1716.lowfreq: -6.6890 -4.4550 0.0004 0.0007 0.0008 7.3478 37.4687 58.1103 85.8618
frequency: 37.4286 58.1069 85.8597 96.4650 102.3796 138.5263 150.7711 164.1080 225.3788 233.2627 258.2410 265.4813 296.9609 330.7060 350.1646 368.8026 411.8481 434.6061 457.6555 476.8959 487.1439 512.1471 523.5959 534.0045 558.3771 598.7301 601.7036 604.6798 622.2376 645.2732 657.4251 681.6363 710.7674 721.0791 749.0130 756.3591 765.1393 769.3213 776.7506 797.5350 830.0737 864.6159 877.0289 888.3278 910.3127 928.1240 955.6673 965.1493 976.3157 981.8584 991.8442 994.9162 999.3830 1048.2972 1053.7839 1055.5847 1064.0910 1088.3978 1118.1500 1135.7853 1152.7016 1157.3139 1177.0487 1180.7360 1183.0682 1193.3599 1215.4579 1219.0209 1244.2913 1285.5016 1293.6904 1300.2781 1309.6722 1315.7069 1328.6254 1341.8749 1348.8498 1372.2790 1375.9194 1430.0093 1433.6456 1456.0237 1475.3066 1486.8414 1487.6685 1496.9268 1581.4920 1585.8206 1605.5627 1610.7961 1680.4742 1719.6456 2980.7699 3008.7450 3016.8878 3040.4255 3067.8145 3082.5269 3117.8139 3118.6655 3125.6141 3135.4766 3143.4882 3153.5006 3164.6490 3168.9036 3585.6656 3601.8857
redmass: 4.8314 8.8290 4.9519 5.1525 4.5302 6.1336 3.6864 6.5441 5.1093 3.0531 5.5471 5.1600 4.0526 3.4000 4.5481 6.3100 4.7515 2.5240 2.1132 3.7260 2.2285 2.2147 3.6361 2.8532 3.1879 4.3568 4.6763 4.7128 4.5987 1.5172 5.2055 4.8828 4.5649 6.1422 1.9890 2.4482 3.2530 1.5569 1.7630 3.1445 2.1527 2.5615 1.4552 1.4944 6.9325 4.5977 1.4384 1.5423 2.7443 2.1248 1.3372 1.3271 1.7798 2.9505 2.7576 3.0907 2.2926 2.8765 1.7651 2.3814 1.4496 1.2949 1.1651 1.2304 2.6244 2.3069 2.1782 2.1185 1.2627 1.5656 1.4154 1.3720 2.3701 3.2608 1.4210 1.4196 1.5428 6.5542 7.4113 2.1301 2.1827 1.1268 2.3003 1.4902 1.5415 1.1177 6.7608 6.8113 6.2041 5.9972 8.6817 9.4937 1.0594 1.0622 1.0644 1.1026 1.1004 1.0993 1.0873 1.0868 1.0885 1.0886 1.0930 1.0938 1.1008 1.0981 1.0801 1.0802
irintensity: 0.0807 0.0150 0.4802 0.3749 0.4841 0.9333 1.8110 1.2320 0.1874 0.5203 0.6594 0.8725 1.7540 1.0241 0.6176 11.1136 7.4320 3.8364 2.4512 13.3698 37.9529 33.0392 15.8336 25.7060 7.5828 3.6740 4.1839 3.4743 15.7719 129.9739 8.0202 3.8116 31.4017 57.5062 10.9009 20.0328 16.0661 63.3930 21.0441 10.2118 11.0980 0.5111 1.2386 0.4238 10.9771 4.8468 0.2680 1.9160 26.6787 2.0357 0.1867 0.4502 2.8530 2.0946 6.5000 8.1637 6.1639 8.2562 2.2643 7.7999 4.3904 5.3918 2.6810 9.1304 73.2497 12.1761 11.9370 4.0180 10.0964 12.2435 0.4501 3.3491 138.6389 97.0313 2.6652 4.8715 7.0984 0.1439 1.2053 5.6233 8.2156 8.6503 27.3679 8.0377 19.7108 27.2148 1.0905 3.9796 2.6642 1.6019 492.4042 437.5480 33.7905 39.4213 24.7462 26.0024 29.2381 22.4882 6.7965 11.0199 2.4286 9.7137 22.4705 21.5339 29.7745 21.0796 81.7903 42.8486
temp: 298.150 k
press: 1.00000 atm
elementType: 8 8 7 7 6 6 6 6 6 6 6 6 6 6 6 6 6 6 6 6 6 6 1 1 1 1 1 1 1 1 1 1 1 1 1 1 1 1
symmnumber: 1
zpe: 791346.0 jmol-1
zpe.correction: 0.301408 hartree
zpe.thermalcorrener: 0.318559 hartree
zpe.thermalcorrenthalpy: 0.319504 hartree
zpe.thermalcorrgfe: 0.257128 hartree
zpe.sumelectzpe: -953.963420 hartree
zpe.sumelectthermal: -953.946268 hartree
zpe.sumelectthermalent: -953.945324 hartree
zpe.sumelectthermalfe: -954.007699 hartree
dipole: -0.2818 -3.2792 -1.2481
dipole: 3.5200
quadrupole: -114.2067 -132.0313 -133.3105
quadrupole: 0.1232 -1.5565 7.2475
quadrupole: 12.3095 -5.5151 -6.7944 0.1232 -1.5565 7.2475
hfenergy: -954.2648274 hartree
pointgroup: C01 [X(C18H16N2O2)]
dipole: 0.1168699 -1.2883969 0.4942385 debye
polarizability: 240.9724808|3.174065|222.5320549|-9.1680529|8.0535952|143.684452 unknown
InChI: InChI=1S/C18H16N2O2/c21-16-18(20-17(22)19-16)14-10-3-1-6-12(14)8-5-9-13-7-2-4-11-15(13)18/h1-4,6-7,10-11,19-20H,5,8-9H2
charge 0 multiplicity 1
38 atoms
O  -0.146092 0.928481 -2.467217
O  0.106916 4.177905 0.9322
N  0.142631 1.797022 0.992122
N  -0.1282 2.781575 -0.997395
C  0.037595 0.648027 0.055726
C  -1.3446 -0.066561 0.201431
C  1.386992 -0.131494 0.122043
C  -1.694296 -1.243289 -0.530587
C  1.603643 -1.435954 0.659903
C  -0.671371 -2.111903 -1.240357
C  0.500825 -2.408065 1.044443
C  -0.067525 -3.117914 -0.218162
C  -0.081371 1.425408 -1.322666
C  -2.348323 0.586848 0.964079
C  2.518105 0.623463 -0.304355
C  0.047095 3.045119 0.399484
C  -3.031615 -1.710559 -0.467345
C  2.940639 -1.916237 0.747876
C  -3.670893 0.099725 1.023906
C  3.830179 0.127386 -0.219065
C  -4.022286 -1.053645 0.29181
C  4.047632 -1.15944 0.322175
H  0.123549 -1.5059 -1.703743
H  -1.15574 -2.675213 -2.058731
H  -0.321943 -1.907526 1.582887
H  0.910933 -3.174211 1.727954
H  -0.850004 -3.834049 0.100254
H  0.736998 -3.698955 -0.708775
H  0.395175 1.689546 1.972845
H  -2.094547 1.496324 1.515777
H  2.368797 1.630793 -0.710359
H  -0.253884 3.532347 -1.676781
H  -3.291765 -2.61485 -1.031252
H  3.100866 -2.918948 1.162684
H  -4.417941 0.626759 1.627115
H  4.671048 0.737486 -0.565136
H  -5.048994 -1.435418 0.310927
H  5.061474 -1.564982 0.408985
