program: Gaussian 09
title: 000070567
version: EM64L-G09RevD.01
frameworkgroup: C1[X(C15H23N3O)]
method: RPBEPBE
basis: SDD
operation: Freq
keyword: #p
keyword: freq=noraman
keyword: PBEPBE/SDD
title: #p freq=noraman PBEPBE/SDD
converged: YES YES NO NO
title: Mulliken charges:
elementType: O N N N C C C C C C C C C C C C C C C H H H H H H H H H H H H H H H H H H H H H H H
charge: -0.265885 -0.091208 -0.407436 -0.614873 0.252528 -0.468440 -0.479204 -0.407401 -0.380384 0.154123 -0.481101 -0.341314 0.453409 -0.691430 -0.448988 -0.379848 -0.221654 -0.230847 -0.247440 0.194859 0.213920 0.217125 0.197972 0.254147 0.218636 0.201804 0.214302 0.252114 0.199053 0.217058 0.210296 0.226127 0.318585 0.354123 0.219476 0.205521 0.218192 0.232677 0.261851 0.222931 0.221497 0.225129
chargesum: 0.00000
title: Mulliken charges with hydrogens summed into heavy atoms:
elementType: O N N N C C C C C C C C C C C C C C C
charge: -0.265885 -0.091208 -0.155322 0.057835 0.252528 -0.059661 -0.064107 0.065382 0.035721 0.154123 -0.064990 0.095109 0.453409 -0.048241 -0.216311 -0.117997 0.001277 -0.009350 -0.022311
polarizability: 2.28663608e+02 5.47068602e+00 1.74878170e+02 -2.08263917e+01 8.59705542e+00 1.37913647e+02
1716.lowfreq: -10.5248 -0.0008 -0.0007 -0.0007 5.5350 8.5979 28.5235 33.8201 41.1560
frequency: 28.3765 33.6653 41.0742 66.1067 79.6817 95.1468 119.4192 144.8536 172.7064 192.2888 224.2808 241.0899 250.7366 269.8309 294.0656 303.7355 329.6167 351.1593 381.3783 388.9139 406.9320 423.3003 463.1628 477.9543 506.0377 552.7894 573.6381 597.8528 616.3481 640.4802 665.1765 684.8966 705.1305 735.1059 739.0830 761.9663 777.0574 806.3884 810.5006 816.2237 859.8929 896.3367 912.2439 917.1385 942.1134 979.9698 982.5188 989.8270 994.9542 1006.8170 1025.2294 1027.9614 1034.1351 1056.8908 1065.6923 1075.2761 1084.0518 1109.4699 1122.8866 1134.3313 1140.8493 1164.0106 1168.6946 1179.2546 1181.8824 1192.4376 1210.7100 1230.3869 1259.1974 1267.2081 1281.4674 1297.1590 1312.7064 1318.0689 1326.4129 1341.8360 1346.9070 1360.0224 1366.5741 1381.5153 1394.1841 1398.7084 1439.6585 1439.7721 1442.3561 1456.3675 1459.9733 1473.7766 1474.4163 1480.4631 1482.0748 1485.9082 1498.6431 1518.1411 1593.9037 1614.1878 1629.0718 2853.8512 2885.6506 2923.1303 2934.7255 2970.6719 2977.4174 2978.6655 2981.4891 3016.1584 3019.1470 3035.3101 3050.1267 3052.8737 3072.0272 3088.0098 3112.5907 3120.6204 3134.3400 3145.6150 3159.9142 3418.5651 3429.9878 3641.6551
redmass: 3.9567 4.3168 4.1714 6.1852 3.0129 3.9864 3.1265 2.0294 3.1587 3.9001 3.9899 2.7486 1.5200 2.3676 2.1903 2.4160 2.6824 2.8233 2.0225 3.5499 2.8580 3.7719 2.9800 3.1613 2.4263 2.8550 1.3843 4.5462 6.2498 2.4217 3.2905 1.8404 2.2006 3.6366 1.6389 1.0758 2.7132 2.3909 2.0701 1.1265 1.2480 2.6049 1.4367 1.7623 1.9137 1.9683 1.4136 5.5090 1.4403 1.8000 2.0439 1.6777 3.1121 2.2467 2.1764 1.6837 2.1746 2.1704 2.0482 3.1021 3.5184 2.7821 1.0656 1.1474 1.8362 1.0924 2.4652 1.4724 1.4002 1.2945 1.4966 1.4913 1.4500 1.5237 1.6054 1.3549 1.4531 1.4083 1.3690 3.6500 1.2441 1.6757 1.1645 1.8251 1.1707 1.1470 1.1281 1.0859 1.0925 1.0563 1.9909 1.1259 1.0937 1.2936 6.1697 6.1394 6.9592 1.0699 1.0700 1.0684 1.0665 1.0623 1.0615 1.0376 1.0868 1.0915 1.0896 1.0935 1.0987 1.0997 1.0987 1.1001 1.0862 1.0865 1.0916 1.0953 1.1014 1.0728 1.0504 1.0991
irintensity: 0.1604 1.1449 0.0404 4.1513 0.7691 2.7317 0.9915 1.1954 1.6621 1.2045 1.6510 1.0839 0.6539 7.9710 13.2775 1.5929 5.6126 4.9194 8.0123 2.6240 0.3120 1.7233 12.0849 1.7962 2.9534 23.5423 142.8481 0.1282 1.6440 46.7772 3.2945 41.9792 33.4449 8.9938 72.7607 79.2517 12.4921 4.2956 1.8443 2.3119 0.3006 1.9372 7.8431 11.9822 2.0732 29.7873 1.1825 0.2199 1.0827 6.4386 14.9707 0.3626 8.1441 5.0590 19.1290 14.8387 4.1992 62.6314 11.5723 2.7080 50.8563 24.0607 1.3495 1.4798 4.5566 4.7288 3.2922 3.1200 17.8767 24.1594 12.3148 11.8686 32.7692 17.2501 15.9323 33.2098 7.6355 15.6444 0.1866 5.0645 18.0921 1.8466 10.0730 9.0958 2.2250 20.4065 6.6931 11.3368 10.2204 6.5622 9.0788 26.5702 13.9972 144.8830 0.8349 8.8141 258.9343 66.9160 85.3618 56.6031 28.5643 18.7583 57.5862 22.4908 19.3893 12.2105 52.9008 32.0231 28.0504 33.2070 50.6456 38.8562 7.5384 0.4086 21.3067 34.6322 29.5475 2.6685 56.2710 61.9521
temp: 298.150 k
press: 1.00000 atm
elementType: 8 7 7 7 6 6 6 6 6 6 6 6 6 6 6 6 6 6 6 1 1 1 1 1 1 1 1 1 1 1 1 1 1 1 1 1 1 1 1 1 1 1
symmnumber: 1
zpe: 948622.7 jmol-1
zpe.correction: 0.361311 hartree
zpe.thermalcorrener: 0.379968 hartree
zpe.thermalcorrenthalpy: 0.380912 hartree
zpe.thermalcorrgfe: 0.313704 hartree
zpe.sumelectzpe: -823.418624 hartree
zpe.sumelectthermal: -823.399967 hartree
zpe.sumelectthermalent: -823.399022 hartree
zpe.sumelectthermalfe: -823.466231 hartree
dipole: -2.4823 1.8458 1.8094
dipole: 3.5837
quadrupole: -99.9741 -111.4255 -117.7222
quadrupole: -3.0250 -6.2001 -3.5401
quadrupole: 9.7332 -1.7183 -8.0149 -3.0250 -6.2001 -3.5401
hfenergy: -823.7799349 hartree
pointgroup: C01 [X(C15H23N3O1)]
dipole: -0.9395468 -0.2679072 -1.016562 debye
polarizability: 227.5655669|-15.78514|157.7614056|17.7476366|19.8192605|156.1284524 unknown
InChI: InChI=1S/C15H23N3O/c1-2-17-15(14(16)19)8-10-18(11-9-15)12-13-6-4-3-5-7-13/h3-7,17H,2,8-12,16H2,1H3
charge 0 multiplicity 1
42 atoms
O  -2.373743 1.070664 2.146697
N  0.624715 0.855753 -0.173093
N  -3.360888 -0.497744 -0.991002
N  -4.255408 1.254325 0.785372
C  -2.283369 0.151303 -0.176957
C  -1.163082 -0.834243 0.279224
C  -1.643218 1.257581 -1.075252
C  0.116503 -0.147924 0.800799
C  -0.397973 1.896883 -0.438224
C  -2.963491 0.851226 1.044569
C  1.923795 1.431315 0.248192
C  -3.943961 -1.760074 -0.46357
C  3.080547 0.440582 0.137873
C  -5.108875 -2.225735 -1.354062
C  4.124935 0.440342 1.094743
C  3.153788 -0.460913 -0.954301
C  5.227549 -0.435374 0.961031
C  4.250988 -1.339332 -1.089052
C  5.294773 -1.328368 -0.132915
H  -0.896407 -1.454112 -0.601241
H  -1.542998 -1.508103 1.069041
H  -2.39919 2.029522 -1.31025
H  -1.329302 0.779547 -2.026319
H  -0.098072 0.322672 1.786511
H  0.901931 -0.912288 0.945044
H  0.029006 2.636568 -1.142024
H  -0.686383 2.444242 0.492926
H  -3.052667 -0.614377 -1.967612
H  1.886499 1.836889 1.291297
H  2.128575 2.29507 -0.41739
H  -3.193089 -2.577891 -0.380594
H  -4.312078 -1.56023 0.560955
H  -4.781909 1.763218 1.493357
H  -4.654513 0.961062 -0.113737
H  -5.895825 -1.452335 -1.407024
H  -4.765513 -2.432532 -2.385998
H  -5.556021 -3.154976 -0.957464
H  4.073355 1.12567 1.950507
H  2.331324 -0.465153 -1.678473
H  6.027218 -0.42486 1.710678
H  4.295014 -2.03218 -1.937695
H  6.146758 -2.009993 -0.236964
