program: Orca
programVersion: 5.0.4
elementType: C H H H H
charge: 0
multiplicity: 1
keywords: Opt RIJCOSX PBEh-3c
formula: CH4
InChI: InChI=1/CH4/h1H4
5 atoms
C  -4.520133 2.792122 -0.007475
H  -3.482217 3.058281 -0.188013
H  -5.035284 3.6324 0.450011
H  -4.56365 1.934368 0.658068
H  -4.999527 2.543359 -0.95044
totalener: -40.42712212 hartree
nucrepener: 13.47731734 hartree
electener: -53.90443946 hartree
oneelecener: -79.89122427 hartree
twoeener: 25.98678480 hartree
kineticenergy: 40.08081171 hartree
exchangeener: -3.654363745895 hartree
correlationener: -0.399144879965 hartree
xcener: -4.053508625860 hartree
dispersion: -0.000682780 hartree
energy: -283.3705 -21.0967 -12.1205 -12.1197 -12.1187 4.7619 5.9670 5.9677 5.9683 13.8100 13.8109 13.8126 28.2573 28.2587 28.2604 29.0274 29.9266 46.6094 46.6113 63.0880 63.0884 63.0905 372.7718 electronvolt
chargesum: 0.0000000
charge: -0.881125 0.220248 0.220292 0.220302 0.220283
charge: -0.522618 0.130638 0.130662 0.130653 0.130666
qa: -0.8811 0.2202 0.2203 0.2203 0.2203
va: 3.7476 0.9164 0.9164 0.9163 0.9164
energy: -40.426628217785 hartree
dipole: -0.00010 0.00001 -0.00009 -0.00005 0.00002 -0.00004 -0.00033 0.00023 -0.00010
magnitude: 0.00014 au
magnitude: 0.00036 debye
