program: Orca
programVersion: 5.0.4
elementType: C H H H H
charge: 0
multiplicity: 1
keywords: SP PWPB95 def2-QZVP def2-TZVP/C def2/J TightSCF
keywords: NoFrozenCore
formula: CH4
InChI: InChI=1/CH4/h1H4
5 atoms
C  0.000013 -0.000003 0.000039
H  1.037913 0.266201 -0.180537
H  -0.51515 0.840312 0.457454
H  -0.043518 -0.85777 0.665555
H  -0.479403 -0.248711 -0.942936
totalener: -40.43947727 hartree
nucrepener: 13.47724537 hartree
electener: -53.91672264 hartree
oneelecener: -79.91175091 hartree
twoeener: 25.99502827 hartree
kineticenergy: 40.27429885 hartree
exchangeener: -3.297692777238 hartree
correlationener: -0.223081078306 hartree
xcener: -3.520773855544 hartree
energy: -286.9623 -21.3786 -12.2304 -12.2294 -12.2274 1.5689 3.6047 3.6048 3.6054 4.3404 4.3406 4.3409 10.5003 10.5008 10.5017 10.8635 12.0400 12.0402 12.9040 18.8398 18.8410 18.8412 19.9055 19.9067 19.9068 21.3540 21.3549 21.3551 26.7159 26.7186 26.7210 28.7257 30.0488 30.0492 30.0500 30.3132 30.3147 32.8014 40.5120 40.5151 40.5163 47.5653 47.5674 51.2908 51.2924 51.2929 52.7997 52.8002 52.8017 56.4956 59.3216 59.3238 59.3244 59.8324 59.8350 59.8367 63.4697 63.4737 69.2663 70.5264 70.5270 70.8252 70.8294 70.8298 76.1684 76.1701 76.1723 80.2267 80.2307 80.2331 82.8038 83.3204 83.3247 83.3257 87.7240 87.7265 87.7319 89.1700 89.1748 89.1864 95.1066 104.4887 104.4949 104.4970 106.5490 106.5515 112.9005 112.9019 112.9058 144.9084 144.9096 148.0252 148.0264 148.0265 154.1903 156.9442 156.9459 156.9517 162.2803 162.2833 162.2885 162.6758 165.5127 165.5173 165.5195 168.3556 168.3606 168.3625 172.3886 174.2433 174.2487 174.2544 178.9463 180.1255 180.1331 180.1387 182.2774 182.2778 190.4146 198.5981 198.6039 198.6104 199.7564 199.7617 201.5927 201.5960 201.5981 207.8961 207.9011 207.9039 210.5121 210.5138 211.1981 211.2010 211.2125 214.0141 214.0200 214.0266 220.7155 224.9713 227.5905 227.5909 228.0968 228.0994 228.1013 229.8293 229.8313 229.8353 230.6704 230.6735 230.6742 240.3097 240.3167 240.3282 245.5519 245.5544 245.5593 257.7281 257.7383 263.7507 263.7564 263.7609 268.3312 268.3317 274.7592 274.7676 274.7706 276.0504 287.3214 287.3285 287.3368 315.7077 315.7197 315.7302 374.5540 799.5256 4052.3579 electronvolt
chargesum: 0.0000000
charge: -0.376116 0.094354 0.094066 0.094222 0.093474
charge: 0.320180 -0.080038 -0.080045 -0.080098 -0.079998
qa: -0.3761 0.0944 0.0941 0.0942 0.0935
va: 3.9096 0.9988 0.9993 0.9990 0.9992
total: -40.500926492 hartree
energy: -40.500926491745 hartree
dipole: -0.00015 0.00032 0.00017 0.00003 -0.00007 -0.00004 -0.00043 0.00051 0.00008
magnitude: 0.00019 au
magnitude: 0.00048 debye
