program: Gaussian 09
title: 000070571
version: EM64L-G09RevD.01
frameworkgroup: C1[X(C14H12N2O3)]
method: RPBEPBE
basis: SDD
operation: Freq
keyword: #p
keyword: freq=noraman
keyword: PBEPBE/SDD
title: #p freq=noraman PBEPBE/SDD
converged: YES YES NO NO
title: Mulliken charges:
elementType: O O O N N C C C C C C C C C C C C C C H H H H H H H H H H H H
charge: -0.443653 -0.240808 -0.257740 -0.191004 0.056965 -0.624890 0.381525 0.506526 0.112940 -0.321968 -0.395259 -0.394138 -0.303230 -0.216602 -0.230576 -0.224181 -0.228007 -0.237487 0.118371 0.264758 0.267519 0.260613 0.271027 0.228587 0.285681 0.240585 0.240655 0.228363 0.226130 0.229628 0.389668
chargesum: 0.00000
title: Mulliken charges with hydrogens summed into heavy atoms:
elementType: O O O N N C C C C C C C C C C C C C C
charge: -0.053985 -0.240808 -0.257740 -0.191004 0.056965 -0.092613 0.381525 0.506526 0.112940 -0.061354 -0.124232 -0.165550 -0.017549 0.023983 0.010079 0.004181 -0.001877 -0.007859 0.118371
polarizability: 1.97836195e+02 1.60240735e+01 1.78340154e+02 -2.88140262e+01 -1.52077692e+00 1.44891091e+02
1716.lowfreq: -10.0092 -8.3184 -4.1826 -0.0003 0.0006 0.0008 11.7416 22.2290 29.9172
frequency: 11.0790 21.9451 29.5914 55.1201 75.5923 102.5103 135.6978 155.6971 202.6475 220.1944 235.5678 309.1446 329.3104 348.8439 386.2589 402.3071 412.8468 424.3335 458.4839 496.2044 525.2220 540.5596 588.3801 602.7143 612.7876 616.6462 649.5461 682.5809 706.0148 730.7642 750.4028 760.7260 783.1825 801.6744 818.2002 852.8242 859.7542 888.5433 933.9207 971.1607 983.1557 984.4972 989.8797 995.1838 1001.3769 1003.1427 1014.9103 1026.1636 1054.3093 1088.2335 1115.2798 1160.8695 1172.8850 1180.1571 1188.6880 1209.5951 1219.3412 1277.6237 1298.9783 1312.6858 1327.6197 1341.1079 1352.4957 1381.6581 1385.7375 1430.1325 1441.4538 1454.3931 1479.7909 1482.9612 1575.0974 1592.6260 1602.0390 1612.1733 1635.4776 3040.6292 3115.4455 3124.5778 3127.2880 3139.2999 3142.8354 3150.6479 3160.6905 3164.6679 3177.5784 3188.7649 3531.7380
redmass: 4.4626 5.6878 5.2703 9.9605 8.7664 4.3358 6.1117 6.2249 6.2601 6.3311 5.3479 8.0807 6.4833 4.8285 2.9076 2.8239 4.0928 3.2324 6.5375 4.2494 5.4144 3.9216 1.2824 4.4983 4.5784 6.2305 5.8459 3.6600 1.9163 2.8496 3.0421 2.7749 1.8678 3.7457 3.2793 2.7797 1.3167 1.5370 1.4874 1.4194 1.5440 2.0660 6.0508 5.5383 1.3289 1.3538 5.8250 2.2377 2.3156 1.5943 1.7284 1.7262 1.0540 1.0782 1.1225 2.9189 1.5485 1.5335 1.8709 2.4221 1.3785 5.3212 1.6800 9.2473 6.5325 2.2230 2.1084 1.1510 2.6438 2.2176 6.9702 6.0627 6.2853 6.0590 8.4486 1.0636 1.0879 1.0964 1.0875 1.0918 1.0869 1.0961 1.0924 1.1015 1.0962 1.0968 1.0642
irintensity: 0.2363 0.3451 0.6468 1.0292 1.5376 0.1727 2.2902 2.2405 2.7363 1.3786 0.6415 7.2854 1.5328 3.4670 3.8832 0.0504 0.4119 10.9233 4.4332 8.4095 12.9068 27.9191 93.7659 58.1012 2.2783 0.2214 5.4472 68.4832 43.7735 59.0630 17.8661 33.7453 20.5423 2.2693 12.2573 150.3223 9.4076 10.9828 3.5156 2.6288 8.8489 6.8780 1.6446 328.3281 1.0926 0.5294 83.1112 5.2820 8.9168 0.8301 64.6986 92.1484 0.0420 0.1124 1.3371 6.0062 9.3674 2.2967 3.3585 83.8642 18.2353 149.1090 15.4233 7.8467 10.1980 10.1717 13.1131 19.9158 40.3055 23.2435 32.5235 0.7109 13.6622 4.3534 256.4258 9.4442 7.7588 0.3803 1.0243 20.1259 2.7140 21.7049 15.4855 21.9130 3.3900 5.6827 61.4027
temp: 298.150 k
press: 1.00000 atm
elementType: 8 8 8 7 7 6 6 6 6 6 6 6 6 6 6 6 6 6 6 1 1 1 1 1 1 1 1 1 1 1 1
symmnumber: 1
zpe: 609646.1 jmol-1
zpe.correction: 0.232202 hartree
zpe.thermalcorrener: 0.248605 hartree
zpe.thermalcorrenthalpy: 0.249549 hartree
zpe.thermalcorrgfe: 0.184900 hartree
zpe.sumelectzpe: -874.465573 hartree
zpe.sumelectthermal: -874.449170 hartree
zpe.sumelectthermalent: -874.448226 hartree
zpe.sumelectthermalfe: -874.512874 hartree
dipole: 1.4732 4.6920 -2.0083
dipole: 5.3121
quadrupole: -95.6154 -111.3650 -108.2725
quadrupole: -0.7734 -4.9627 9.0324
quadrupole: 9.4689 -6.2807 -3.1882 -0.7734 -4.9627 9.0324
hfenergy: -874.6977744 hartree
pointgroup: C01 [X(C14H12N2O3)]
dipole: -0.4538345 -1.844466 -0.8716661 debye
polarizability: 194.4686531|15.8041181|179.8997869|30.5571414|4.8403222|146.6990007 unknown
InChI: InChI=1S/C14H12N2O3/c17-14(18)12-8-4-5-9-13(12)16(15-19)10-11-6-2-1-3-7-11/h1-9,17H,10H2
charge 0 multiplicity 1
31 atoms
O  -3.689209 0.315207 -1.963871
O  -2.088638 1.867408 -1.35312
O  0.784355 2.584905 1.955878
N  -0.198788 1.015017 0.654503
N  -0.085562 1.645264 1.908822
C  0.69314 1.387055 -0.489412
C  -1.041985 -0.146454 0.655245
C  1.932919 0.503896 -0.556838
C  -2.128579 -0.339597 -0.258642
C  -0.773109 -1.133944 1.63566
C  3.057542 0.775685 0.266271
C  1.980306 -0.601891 -1.443225
C  -2.871424 -1.551189 -0.190435
C  -1.538977 -2.314789 1.702793
C  -2.582711 -2.533617 0.774529
C  4.2051 -0.045208 0.201321
C  3.127986 -1.423969 -1.508392
C  4.243847 -1.147428 -0.685079
C  -2.574449 0.718981 -1.204933
H  0.964024 2.442509 -0.311252
H  0.095989 1.333896 -1.409848
H  0.0579 -0.966479 2.32637
H  3.026312 1.632047 0.949193
H  1.119073 -0.816015 -2.088717
H  -3.694792 -1.690684 -0.894832
H  -1.309987 -3.066282 2.465775
H  -3.171096 -3.455928 0.809566
H  5.069809 0.176309 0.837002
H  3.154206 -2.27274 -2.20108
H  5.136101 -1.781576 -0.736773
H  -3.955801 1.07271 -2.550779
