program: Orca
programVersion: 6.0.0
elementType: C H H H H
charge: 0
multiplicity: 1
keywords: Opt RIJCOSX PBEh-3c
formula: CH4
InChI: InChI=1/CH4/h1H4
5 atoms
C  -4.52016 2.792151 -0.00755
H  -3.482217 3.058271 -0.188023
H  -5.035272 3.632352 0.450063
H  -4.56366 1.934401 0.658116
H  -4.999501 2.543364 -0.950456
totalener: -40.42706748331370 hartree
nucrepener: 13.40833245937109 hartree
electener: -53.83539994268479 hartree
oneelecener: -79.76158745975555 hartree
twoeener: 25.92618751707076 hartree
kineticenergy: 40.05123320749405 hartree
exchangeener: -3.649935484914 hartree
correlationener: -0.398757158375 hartree
xcener: -4.048692643289 hartree
dispersion: -0.000682617 hartree
dispersion: -0.000682784 hartree
energy: -283.3689 -21.0964 -12.1198 -12.1196 -12.1190 4.7619 5.9674 5.9678 5.9679 13.8089 13.8093 13.8094 28.2583 28.2592 28.2597 29.0274 electronvolt
chargesum: -0.0000000
charge: -0.881004 0.220246 0.220262 0.220247 0.220248
charge: -0.522567 0.130640 0.130646 0.130639 0.130641
qa: -0.8810 0.2202 0.2203 0.2202 0.2202
va: 3.7476 0.9164 0.9164 0.9164 0.9164
dispersion: -0.000682780 hartree
energy: -40.426627760051 hartree
dipole: -0.000008593 0.000000020 -0.000008573 -0.000152585 0.000127613 -0.000024973 -0.000071574 0.000041027 -0.000030547
dipolemethod: SCF
magnitude: 0.000040376 au
magnitude: 0.000102628 debye
