program: Orca
programVersion: 5.0.4
elementType: C H
charge: 0
multiplicity: 2
keywords: SP BP86 def2-TZVP def2-TZVP/C def2/J TightSCF
keywords: NoFrozenCore
formula: CH
InChI: InChI=1/CH/h1H
2 atoms
C  0.086756 0.0000 0.0000
H  -1.033795 0.0000 0.0000
totalener: -38.48712784 hartree
nucrepener: 2.83348254 hartree
electener: -41.32061038 hartree
oneelecener: -56.65359727 hartree
twoeener: 15.33298689 hartree
kineticenergy: 38.34736336 hartree
exchangeener: -5.415461181865 hartree
correlationener: -0.204667510161 hartree
xcener: -5.620128692026 hartree
s2: 0.752955
energy: -272.4123 -16.1994 -7.7400 -6.0143 -5.3619 1.2911 4.6434 5.3070 5.7837 5.7869 10.7165 15.7440 15.8833 16.4121 16.6847 23.6760 32.6405 34.9266 35.6815 38.0539 45.8993 45.9681 52.8470 65.5593 69.5237 69.5983 69.7110 69.7203 76.4830 76.4975 76.9650 77.0132 82.2040 82.4016 87.4728 108.0995 573.0002 electronvolt
energy: -272.0268 -15.1967 -7.2571 -4.8087 -3.3373 1.5054 5.1010 6.0411 6.0510 6.6455 10.9844 16.0098 16.8443 17.8941 17.9237 24.1834 33.6072 36.1194 37.3340 38.5948 46.0265 46.5983 53.1148 65.8660 70.8304 70.8399 71.6461 71.6597 77.1700 78.5305 79.0524 79.1056 82.5670 83.6448 88.1407 108.7764 573.5809 electronvolt
chargesum: 0.0000000
charge: -0.118359 0.118359
charge: -0.064374 0.064374
qa: -0.1184 0.1184
va: 1.8999 0.9059
energy: -38.487127838877 hartree
dipole: -0.96988 0.39091 -0.57897 0.00000 -0.00000 -0.00000 0.00000 0.00000 0.00000
magnitude: 0.57897 au
magnitude: 1.47162 debye
