program: Orca
programVersion: 5.0.4
elementType: C H
charge: 0
multiplicity: 2
keywords: Freq RIJCOSX PBEh-3c
frequency: 0.00 0.00 0.00 0.00 0.00 2933.55
frequency: 2933.55
formula: CH
InChI: InChI=1/CH/h1H
2 atoms
C  -4.702892 2.493464 -0.136589
H  -4.954628 2.931146 -1.136941
totalener: -38.38291334 hartree
nucrepener: 2.83347645 hartree
electener: -41.21638979 hartree
oneelecener: -56.64182148 hartree
twoeener: 15.42543168 hartree
kineticenergy: 38.16840310 hartree
exchangeener: -3.001901229588 hartree
correlationener: -0.260064946386 hartree
xcener: -3.261966175974 hartree
s2: 0.752650
energy: -286.8861 -19.7059 -10.0410 -8.3536 -2.7282 4.7866 13.7379 14.3185 14.7741 18.9856 26.6419 46.3744 46.5353 46.7131 46.7272 58.4443 360.8668 electronvolt
energy: -286.4392 -18.2225 -9.3185 -2.1423 -0.7513 5.1270 14.6610 15.1804 16.2678 19.7427 27.0752 46.9961 48.2793 48.6389 48.6829 59.1943 361.4926 electronvolt
chargesum: 0.0000000
charge: -0.160434 0.160434
charge: -0.087914 0.087914
qa: -0.1604 0.1604
va: 1.9133 0.9097
dispersion: -0.000138920 hartree
energy: -38.382714293049 hartree
dipole: -0.21789 0.07934 -0.13854 0.37883 -0.13804 0.24079 -0.86584 0.31543 -0.55041
magnitude: 0.61654 au
magnitude: 1.56713 debye
temp: 298.15 k
press: 1.00 atm
zeropoint: 0.00668312 hartree
thermalvibcorrection: 0.00000001 hartree
thermalrotcorrection: 0.00094418 hartree
thermaltrasncorrection: 0.00141627 hartree
thermaltotal: -38.37367072 hartree
thermalcorr: 0.00236046 hartree
nonthermalcorr: 0.00668312 hartree
totalcorr: 0.00904358 hartree
thermalcorrenthalpy: 0.00094421 hartree
totalenthalpy: -38.37272651 hartree
vibrat: 0.00000001 hartree
rotat: 0.00345951 hartree
transl: 0.01598380 hartree
total: 0.02009778 hartree
totalentropycorr: -0.02009778 hartree
gibbsenthalpy: -38.39282429 hartree
gibbsminuselec: -0.01010999 hartree
