program: Orca
programVersion: 5.0.4
elementType: C H
charge: 0
multiplicity: 2
keywords: SP DLPNO-CCSD(T) aug-cc-pVQZ aug-cc-pVQZ/C TightSCF
keywords: NoFrozenCore
formula: CH
InChI: InChI=1/CH/h1H
2 atoms
C  0.01949 -0.033887 0.07745
H  -0.232246 0.403795 -0.922902
totalener: -38.28395463 hartree
nucrepener: 2.83347642 hartree
electener: -41.11743105 hartree
oneelecener: -56.60655981 hartree
twoeener: 15.48912876 hartree
kineticenergy: 38.26247926 hartree
s2: 0.759739
energy: -308.2068 -23.9299 -12.8792 -11.5788 0.5012 0.7148 2.1976 2.2642 2.8257 3.4660 5.2785 5.9374 5.9672 6.3525 6.3581 7.7249 7.8637 8.0078 9.2545 11.6110 12.1631 13.1584 14.9923 17.1034 17.1871 17.9927 17.9928 20.1933 20.5722 20.5727 21.0423 21.2354 21.2757 22.6734 22.7101 24.2729 25.0474 25.0586 25.0791 25.1850 29.5104 34.3493 34.7307 39.1777 45.1762 45.1776 45.7802 45.9902 46.4276 52.1029 52.6218 52.6420 53.5113 53.5370 57.6416 57.6664 57.6681 58.0259 58.0345 59.3138 59.4105 61.4186 61.4272 61.7493 61.7496 62.4627 64.6939 65.0526 65.6047 65.6093 65.6132 65.8364 66.0792 72.2516 72.4454 79.4085 87.5394 94.5838 94.9137 96.2283 96.2373 108.8850 112.2431 112.5217 112.7326 159.3354 159.3707 159.5613 159.7763 160.6406 160.6439 161.3005 161.3012 162.4758 168.7890 169.1388 169.9622 170.4759 173.5749 173.5822 176.0879 176.0886 176.3860 178.9017 178.9567 182.6145 184.3932 184.3932 196.7938 198.6993 199.0918 208.4823 208.4839 224.0845 224.3136 226.0829 242.9485 242.9505 248.4700 253.8776 254.1329 270.8972 271.2987 281.6362 329.1453 627.9929 electronvolt
energy: -307.5763 -21.3667 -11.8439 0.7426 0.8044 1.4666 2.2881 3.0483 3.5864 3.8985 5.3477 5.9756 6.2213 6.5162 6.5321 7.7642 8.0465 8.2690 9.5004 11.7699 13.4086 14.3053 15.2782 17.1884 17.5566 18.2715 18.2844 20.5001 20.8002 20.8013 21.1876 21.8885 22.0109 22.7207 23.2337 24.3514 25.0957 25.3974 25.4363 25.5326 29.7832 34.8427 35.4994 39.4169 45.2972 45.3000 46.1312 46.5127 46.8959 52.2517 52.7552 52.7760 53.6610 54.5911 58.0410 58.0420 58.1113 58.7016 58.7197 59.5602 60.4259 62.2896 62.4591 62.4660 62.5580 63.1324 64.7224 65.4413 65.6630 65.9177 65.9288 66.2060 66.6724 72.2981 72.9804 79.8227 87.7590 94.5917 95.1304 96.4570 96.4810 109.0344 112.3463 112.9987 113.1736 159.6657 159.7562 159.7639 160.8744 161.1209 161.3328 162.0273 162.0320 162.8318 168.9418 169.9484 170.0891 171.2802 174.5891 174.6291 176.7816 177.1713 177.1798 179.7247 179.9387 182.8999 184.5235 184.5237 196.9229 198.8785 200.0072 208.6635 208.6703 224.0575 224.4034 226.1297 242.9602 242.9632 248.5626 253.8552 254.2064 270.9379 271.5844 281.6885 329.2100 628.4007 electronvolt
chargesum: -0.0000000
charge: -0.278742 0.278742
charge: 0.713223 -0.713223
qa: -0.2787 0.2787
va: 1.8106 0.8295
corrType: DLPNO BASED
energy: -38.446284201821 hartree
dipole: -0.21789 0.07823 -0.13966 0.37883 -0.13601 0.24282 -0.86584 0.31087 -0.55497
magnitude: 0.62166 au
magnitude: 1.58013 debye
