program: Orca
programVersion: 5.0.4
elementType: C H
charge: 0
multiplicity: 2
keywords: SP F12/RI-CCSD(T) cc-pVTZ-F12 cc-pVTZ-F12-CABS cc-pVQZ/C VeryTightSCF
keywords: NoFrozenCore
formula: CH
InChI: InChI=1/CH/h1H
2 atoms
C  0.01949 -0.033887 0.07745
H  -0.232246 0.403795 -0.922902
totalener: -38.28382180 hartree
nucrepener: 2.83347662 hartree
electener: -41.11729843 hartree
oneelecener: -56.60705731 hartree
twoeener: 15.48975888 hartree
kineticenergy: 38.26353096 hartree
s2: 0.759484
energy: -308.2027 -23.9281 -12.8771 -11.5766 0.5104 1.7724 2.2839 2.5448 2.9718 5.6832 9.8998 11.3918 12.0520 12.2263 12.8037 12.9497 14.2408 19.3741 19.3917 21.9539 25.0836 25.2548 28.0691 37.1215 37.1663 37.5277 37.5707 37.5717 38.6363 38.7998 42.1752 43.0065 47.3158 52.0198 52.2180 52.4496 52.9975 53.0096 54.2770 61.7882 61.8029 66.5550 66.9680 66.9789 81.7901 81.8861 81.9602 96.1328 123.9617 123.9626 124.6829 124.6973 127.5658 128.0158 131.7571 141.5707 141.6475 152.6544 154.1511 154.3916 182.9425 209.0161 209.0172 215.6598 216.0150 221.4978 244.4745 556.2172 556.6547 561.9696 589.5378 electronvolt
energy: -307.5713 -21.3650 -11.8400 0.8194 1.4903 1.8466 2.6189 3.2119 4.1318 5.8026 10.0873 12.0928 12.5252 13.2012 13.2101 14.1646 14.5373 20.6660 20.6716 22.2800 25.3276 26.1362 28.4588 37.1884 37.5651 38.0169 38.1033 38.1535 38.7280 39.3051 43.3603 44.7527 47.6273 52.0777 52.2164 52.7040 53.1234 53.1833 54.7866 61.8802 62.6642 66.8659 68.7899 68.9775 81.9630 82.4347 83.0189 96.4329 125.0493 125.0701 125.4285 125.5170 127.8026 128.9796 132.3530 141.8773 143.4059 152.8767 154.1086 154.5295 183.0689 210.1627 210.1885 215.8875 217.1662 221.8578 244.5937 556.3821 557.4158 562.2807 589.8395 electronvolt
corrType: UHF
chargesum: -0.0000000
charge: -0.078945 0.078945
charge: 0.353664 -0.353664
qa: -0.0789 0.0789
va: 2.2509 0.9664
energy: -38.472257706543 hartree
dipole: -0.21789 0.09090 -0.12699 0.37883 -0.15804 0.22079 -0.86584 0.36121 -0.50464
magnitude: 0.56527 au
magnitude: 1.43681 debye
dipolemethod: MDCI
