program: Orca
programVersion: 5.0.4
elementType: C H
charge: 0
multiplicity: 2
keywords: SP PWPB95 def2-QZVP def2-TZVP/C def2/J TightSCF
keywords: NoFrozenCore
formula: CH
InChI: InChI=1/CH/h1H
2 atoms
C  0.086756 0.0000 0.0000
H  -1.033795 0.0000 0.0000
totalener: -38.43242349 hartree
nucrepener: 2.83348254 hartree
electener: -41.26590603 hartree
oneelecener: -56.65711425 hartree
twoeener: 15.39120822 hartree
kineticenergy: 38.33424464 hartree
exchangeener: -2.714495846288 hartree
correlationener: -0.144164802745 hartree
xcener: -2.858660649033 hartree
s2: 0.754146
energy: -290.4712 -20.0106 -10.3489 -8.6442 -2.3196 1.8268 4.5019 4.5906 4.9327 6.7741 10.6323 12.9224 13.0684 14.2513 14.2915 19.2708 21.1488 21.6478 21.9667 22.3437 22.4671 26.3735 31.9746 45.2272 45.2516 47.2540 47.2551 47.6693 47.7493 50.9965 51.3482 51.3785 53.8115 54.9144 55.0605 63.7414 64.8773 64.8968 67.1045 67.2009 72.4252 75.0429 75.3465 87.5102 92.6854 92.7344 102.2732 129.0362 129.0530 131.5037 131.5575 135.3189 135.3262 146.2053 147.4786 147.6096 156.1797 156.4040 160.5086 160.5334 160.7886 160.9801 161.0838 162.3404 162.4379 165.9306 165.9342 170.7389 178.7020 178.7213 189.4700 198.0899 198.0929 202.8312 202.8959 204.8629 217.6735 218.4152 218.4192 230.7821 230.8255 256.5362 261.7332 261.8454 318.8262 755.6811 4005.4987 electronvolt
energy: -289.9983 -18.3951 -9.5747 -1.7635 -0.6575 1.9778 4.6894 5.1665 5.7016 6.9813 11.0059 13.1401 13.6458 15.0300 15.0459 19.5465 21.4239 22.0679 22.4426 22.7709 23.5829 26.5560 32.2407 45.8180 45.8193 47.9805 48.1479 48.1725 48.8768 51.5708 52.6991 52.7539 54.4120 55.0539 55.8288 64.2079 65.1949 65.3107 67.1195 67.4475 72.5992 75.7450 76.8074 87.7271 92.8915 93.6731 102.6449 129.9142 129.9145 132.6417 132.6425 136.0287 136.0346 146.6697 147.7858 148.7486 156.3036 157.2658 161.0393 161.5372 162.0248 162.1760 162.1788 163.9650 164.0163 166.2445 166.2447 171.1082 179.0425 180.0713 190.4527 198.5573 198.5658 202.8330 203.1569 205.1171 217.8794 218.5068 218.5200 230.7857 231.0518 256.6874 261.8535 262.4897 319.1562 756.4307 4005.7362 electronvolt
chargesum: -0.0000000
charge: -0.068306 0.068306
charge: 0.242385 -0.242385
qa: -0.0683 0.0683
va: 1.8936 0.9184
total: -38.469129441 hartree
energy: -38.469129440723 hartree
dipole: -0.96988 0.37642 -0.59346 0.00000 -0.00000 -0.00000 0.00000 -0.00000 -0.00000
magnitude: 0.59346 au
magnitude: 1.50847 debye
