program: Orca
programVersion: 6.0.0
elementType: C H
charge: 0
multiplicity: 2
keywords: SP revDSD-PBEP86/2021 def2-QZVP def2-TZVP/C def2/J TightSCF D3BJ
keywords: NoFrozenCore
formula: CH
InChI: InChI=1/CH/h1H
2 atoms
C  0.086755 0.0000 0.0000
H  -1.033776 0.0000 0.0000
totalener: -38.35875975717622 hartree
nucrepener: 2.83353670266769 hartree
electener: -41.19229032473720 hartree
oneelecener: -56.62538546682678 hartree
twoeener: 15.43309514208957 hartree
kineticenergy: 38.28066862075569 hartree
exchangeener: -1.667500184938 hartree
correlationener: -0.087234582564 hartree
xcener: -1.754734767502 hartree
s2: 0.756785
energy: -297.1227 -21.6151 -11.3573 -9.8950 -1.0648 2.4289 5.0331 5.1653 5.8168 7.5009 11.6510 13.7795 14.0376 15.0909 15.1629 electronvolt
energy: -296.5790 -19.5908 -10.5127 -0.5835 0.6694 2.6010 5.2670 6.0316 6.7450 7.7977 12.0842 14.0771 14.6933 16.1046 electronvolt
chargesum: -0.0000000
charge: -0.048412 0.048412
charge: 0.241989 -0.241989
qa: -0.0484 0.0484
va: 1.9169 0.9342
total: -38.433795442 hartree
dispersion: -0.000177451 hartree
energy: -38.433972893441 hartree
dipole: -0.969861211 0.355091019 -0.614770192 0.000000000 0.000000014 0.000000014 0.000000000 -0.000000000 -0.000000000
dipolemethod: SCF
magnitude: 0.614770192 au
magnitude: 1.562621645 debye
