program: Orca
programVersion: 6.0.0
elementType: C H
charge: 0
multiplicity: 2
keywords: Opt RIJCOSX PBEh-3c
formula: CH
InChI: InChI=1/CH/h1H
2 atoms
C  0.560265 0.0000 0.0000
H  -0.560265 0.0000 0.0000
totalener: -38.38279221098833 hartree
nucrepener: 2.86816915067751 hartree
electener: -41.25096136166584 hartree
oneelecener: -56.70596917590437 hartree
twoeener: 15.45500781423853 hartree
kineticenergy: 38.18374788383962 hartree
exchangeener: -3.004542094865 hartree
correlationener: -0.260285156509 hartree
xcener: -3.264827251374 hartree
s2: 0.752624
dispersion: -0.000138887 hartree
s2: 0.752646
dispersion: -0.000138918 hartree
s2: 0.752648
dispersion: -0.000138920 hartree
energy: -286.8840 -19.7057 -10.0406 -8.3522 -2.7277 4.7870 13.7398 14.3178 14.7748 18.9864 26.6431 46.3752 46.5371 46.7139 46.7273 electronvolt
energy: -286.4378 -18.2233 -9.3182 -2.1418 -0.7513 5.1264 14.6617 15.1809 16.2681 19.7426 27.0740 46.9974 48.2804 48.6387 electronvolt
chargesum: -0.0000000
charge: -0.160486 0.160486
charge: -0.087925 0.087925
qa: -0.1605 0.1605
va: 1.9132 0.9097
energy: -38.382712706542 hartree
dipole: -0.969860869 0.353382511 -0.616478358 0.000000000 0.000000000 0.000000000 0.000000000 -0.000000000 -0.000000000
dipolemethod: SCF
magnitude: 0.616478358 au
magnitude: 1.566963457 debye
