program: Orca
programVersion: 5.0.4
elementType: C H
charge: 0
multiplicity: 2
keywords: Freq RIJCOSX PBEh-3c
frequency: 0.00 0.00 0.00 0.00 0.00 2933.86
frequency: 2933.86
formula: CH
InChI: InChI=1/CH/h1H
2 atoms
C  0.560276 0.0000 0.0000
H  -0.560276 0.0000 0.0000
totalener: -38.38291255 hartree
nucrepener: 2.83348251 hartree
electener: -41.21639506 hartree
oneelecener: -56.64190924 hartree
twoeener: 15.42551418 hartree
kineticenergy: 38.16838531 hartree
exchangeener: -3.001906885840 hartree
correlationener: -0.260064998724 hartree
xcener: -3.261971884564 hartree
s2: 0.752651
energy: -286.8861 -19.7053 -10.0406 -8.3547 -2.7281 4.7869 13.7391 14.3186 14.7745 18.9867 26.6432 46.3755 46.5361 46.7136 46.7277 58.4448 360.8664 electronvolt
energy: -286.4389 -18.2216 -9.3184 -2.1423 -0.7510 5.1275 14.6612 15.1811 16.2691 19.7431 27.0765 46.9969 48.2805 48.6397 48.6836 59.1949 361.4925 electronvolt
chargesum: -0.0000000
charge: -0.160499 0.160499
charge: -0.087935 0.087935
qa: -0.1605 0.1605
va: 1.9133 0.9097
dispersion: -0.000138920 hartree
energy: -38.382713497886 hartree
dipole: -0.96988 0.35323 -0.61665 0.00000 0.00000 0.00000 0.00000 0.00000 0.00000
magnitude: 0.61665 au
magnitude: 1.56740 debye
temp: 298.15 k
press: 1.00 atm
zeropoint: 0.00668383 hartree
thermalvibcorrection: 0.00000001 hartree
thermalrotcorrection: 0.00094418 hartree
thermaltrasncorrection: 0.00141627 hartree
thermaltotal: -38.37366921 hartree
thermalcorr: 0.00236046 hartree
nonthermalcorr: 0.00668383 hartree
totalcorr: 0.00904429 hartree
thermalcorrenthalpy: 0.00094421 hartree
totalenthalpy: -38.37272500 hartree
vibrat: 0.00000001 hartree
rotat: 0.00345951 hartree
transl: 0.01598380 hartree
total: 0.02009778 hartree
totalentropycorr: -0.02009778 hartree
gibbsenthalpy: -38.39282277 hartree
gibbsminuselec: -0.01010928 hartree
