program: Orca
programVersion: 6.0.0
elementType: C
charge: 0
multiplicity: 3
keywords: SP revDSD-PBEP86/2021 def2-QZVP def2-TZVP/C def2/J TightSCF D3BJ
keywords: NoFrozenCore
formula: C
InChI: InChI=1/C
1 atoms
C  0.0000 0.0000 0.0000
totalener: -37.74947005632124 hartree
nucrepener: 0.00000000000000 hartree
electener: -37.74946996942318 hartree
oneelecener: -50.45270880347994 hartree
twoeener: 12.70323883405676 hartree
kineticenergy: 37.69624207997427 hartree
exchangeener: -1.558617854519 hartree
correlationener: -0.069228008413 hartree
xcener: -1.627845862932 hartree
s2: 2.007177
energy: -297.7378 -20.1094 -10.1865 -10.1865 -1.1724 4.9859 4.9859 5.7326 6.6622 14.9092 14.9092 15.1144 15.1144 15.2633 22.8391 electronvolt
energy: -296.6658 -14.8645 -0.3130 0.9578 0.9578 6.1214 6.8770 6.8770 7.6081 15.9783 16.1846 16.1846 16.8251 electronvolt
chargesum: 0.0000000
charge: 0.000000
total: -37.801368534 hartree
dispersion: 0.000000000 hartree
energy: -37.801368533868 hartree
dipole: 0.000000000 -0.000000084 -0.000000084 0.000000000 0.000000053 0.000000053 0.000000000 -0.000000192 -0.000000192
dipolemethod: SCF
magnitude: 0.000000216 au
magnitude: 0.000000549 debye
