program: Orca
programVersion: 6.0.0
elementType: C
charge: 0
multiplicity: 3
keywords: RIJCOSX PBEh-3c
formula: C
InChI: InChI=1/C
1 atoms
C  0.0010 0.0010 0.0010
totalener: -37.75397353248424 hartree
nucrepener: 0.00000000000000 hartree
electener: -37.75397353248424 hartree
oneelecener: -50.45520143508483 hartree
twoeener: 12.70122790260060 hartree
kineticenergy: 37.55562526330682 hartree
exchangeener: -2.803829989791 hartree
correlationener: -0.209850770107 hartree
xcener: -3.013680759898 hartree
s2: 2.002132
energy: -287.6198 -17.9774 -8.6448 -8.6448 -2.9440 13.5310 13.5310 14.5283 17.2478 45.9596 45.9597 46.2668 46.2668 46.5904 357.0167 electronvolt
energy: -286.7367 -14.0848 -1.8953 -0.4866 -0.4866 15.2717 16.3639 16.3639 19.0981 48.1156 48.5556 48.5556 49.8570 electronvolt
chargesum: 0.0000000
charge: 0.000000
charge: -0.000000
dispersion: 0.000000000 hartree
energy: -37.753973532484 hartree
dipole: 0.000000000 -0.000000000 -0.000000000 0.000000000 0.000000000 0.000000000 0.000000000 -0.000000000 -0.000000000
dipolemethod: SCF
magnitude: 0.000000000 au
magnitude: 0.000000000 debye
