program: Gaussian 09
title: 000070568
version: EM64L-G09RevD.01
frameworkgroup: C1[X(C16H23N3)]
method: RPBEPBE
basis: SDD
operation: Freq
keyword: #pfreq=noraman
keyword: PBEPBE/SDD
title: #p freq=noraman PBEPBE/SDD
converged: YES YES NO NO
title: Mulliken charges:
elementType: N N N C C C C C C C C C C C C C C C C H H H H H H H H H H H H H H H H H H H H H H H
charge: -0.082703 -0.341541 -0.025678 0.336379 -0.481746 -0.475559 -0.396771 -0.397342 -0.476495 -0.086603 -0.254333 0.447748 -0.662489 -0.705739 -0.447579 -0.380988 -0.221298 -0.229555 -0.245841 0.241727 0.202060 0.211475 0.231964 0.219266 0.238638 0.214223 0.204554 0.251440 0.198413 0.220945 0.217731 0.208854 0.206256 0.237817 0.236783 0.212261 0.200594 0.233091 0.263489 0.224902 0.224352 0.227294
chargesum: 0.00000
title: Mulliken charges with hydrogens summed into heavy atoms:
elementType: N N N C C C C C C C C C C C C C C C C
charge: -0.082703 -0.090101 -0.025678 0.336379 -0.037959 -0.032120 0.061134 0.021436 -0.057136 0.131127 -0.254333 0.447748 -0.009561 -0.056101 -0.214488 -0.117499 0.003604 -0.005202 -0.018547
polarizability: 2.36223457e+02 1.84810664e+00 1.84091425e+02 -1.69929106e+01 2.36249306e+00 1.36411373e+02
1716.lowfreq: -7.0099 -0.0007 -0.0007 -0.0006 2.2811 7.9954 26.0355 30.0094 34.6869
frequency: 25.9887 29.9161 34.6447 50.0395 80.2424 99.9409 123.8732 145.4109 162.4508 195.5137 205.1762 226.8553 239.8578 257.9472 268.1817 289.1107 329.5673 339.4775 347.7745 389.8113 404.0399 407.0808 422.4633 454.1910 466.8808 483.0387 558.2244 568.6908 590.5895 604.5140 616.9317 642.6951 699.6814 705.7674 739.1812 775.9595 809.1671 815.1977 830.8063 860.9587 879.3237 912.0907 915.3480 928.5755 939.1952 947.6135 983.4181 986.4944 989.8321 995.9639 1008.8177 1024.0390 1025.5490 1042.4824 1076.1505 1104.9047 1111.8228 1127.4249 1129.6427 1138.3947 1150.3512 1169.5447 1174.1634 1179.9914 1182.1288 1189.7900 1211.6866 1234.0884 1262.4110 1274.0498 1294.3947 1309.2754 1313.1704 1318.0692 1331.4476 1338.0519 1347.9386 1363.2023 1377.0503 1381.2890 1393.1273 1397.6128 1440.5737 1445.2540 1454.6348 1458.7051 1461.2089 1464.1359 1464.2133 1472.4386 1480.6931 1483.7950 1483.8940 1484.9653 1594.3057 1614.6696 2147.1278 2846.9685 2853.2647 2863.1629 2973.8008 2977.1155 2985.5918 2999.6606 3001.1505 3006.4286 3026.9431 3046.8895 3064.9734 3071.5135 3074.8808 3075.4461 3086.3713 3096.9717 3113.0232 3122.2653 3135.3136 3146.1370 3161.1521 3435.7961
redmass: 3.7778 3.0915 3.8704 4.8825 3.8722 5.5328 3.3355 4.3754 3.9118 3.7885 1.1572 1.8311 3.2602 1.5652 2.1053 2.9341 2.2991 2.6133 2.4607 2.2163 3.0524 2.8979 3.1638 2.1301 2.4951 3.1134 2.6820 4.6939 3.0305 3.8859 6.3654 3.4388 2.9949 2.1863 1.6164 2.7807 3.6463 1.7019 2.1284 1.2476 2.4040 1.2647 1.4121 2.1721 1.4160 1.8481 1.3917 2.1343 5.5238 1.4367 1.7136 1.6918 2.0476 2.5008 1.6181 2.4661 2.6515 2.5201 2.2435 2.5071 2.9216 1.0663 1.4581 1.1200 1.8776 1.5861 2.5757 1.6149 1.3753 1.4674 1.4092 1.3658 1.4208 1.3829 1.3149 1.3386 1.4147 1.4346 1.2176 3.4463 1.2225 1.7567 2.0943 1.0878 1.1496 1.0867 1.1169 1.0561 1.0484 1.1074 1.3572 1.3147 1.2574 1.0516 6.1648 6.1315 12.6739 1.0709 1.0718 1.0696 1.0370 1.0378 1.0867 1.0697 1.0663 1.0698 1.0855 1.0879 1.0986 1.1029 1.0978 1.1019 1.0990 1.1004 1.0868 1.0862 1.0914 1.0956 1.1014 1.0742
irintensity: 0.3383 0.1465 0.3858 0.5827 1.1007 3.1547 0.6649 4.1340 0.2339 1.0887 1.6895 1.9794 4.6916 0.2536 0.2234 0.6028 2.4029 2.3757 9.4629 0.6800 1.3413 0.5988 1.6894 13.6901 15.7805 3.3602 27.4002 1.3615 46.5979 11.1525 0.0570 3.0955 13.8955 31.5253 54.4442 29.8675 2.1853 1.5710 2.3904 0.2709 2.6075 4.0324 6.3183 1.5489 0.3614 1.7954 1.4984 26.5743 0.6304 2.5283 6.9411 7.0351 7.7036 10.0318 17.3182 31.3828 11.9990 39.8311 20.4247 3.8279 6.4301 1.5124 34.4439 6.3552 63.4431 7.6030 4.2244 6.6120 7.4751 12.5417 11.5851 10.7508 3.3681 8.0939 5.0522 31.4842 5.5079 3.4747 22.3694 3.2358 23.8152 1.4473 11.9125 7.4290 8.0280 17.7836 8.2503 0.9466 3.8080 6.4898 9.1720 6.6971 12.3808 24.5090 0.9383 7.2311 6.2578 32.6727 39.3414 146.3589 19.8886 31.6248 20.6223 8.1000 39.1793 12.4006 46.5195 21.4263 2.5784 4.7756 92.9468 26.2476 31.7540 35.7850 8.1046 0.1440 17.4572 33.9945 28.0866 0.8426
temp: 298.150 k
press: 1.00000 atm
elementType: 7 7 7 6 6 6 6 6 6 6 6 6 6 6 6 6 6 6 6 1 1 1 1 1 1 1 1 1 1 1 1 1 1 1 1 1 1 1 1 1 1 1
symmnumber: 1
zpe: 944291.4 jmol-1
zpe.correction: 0.359662 hartree
zpe.thermalcorrener: 0.378775 hartree
zpe.thermalcorrenthalpy: 0.379719 hartree
zpe.thermalcorrgfe: 0.311215 hartree
zpe.sumelectzpe: -786.280837 hartree
zpe.sumelectthermal: -786.261724 hartree
zpe.sumelectthermalent: -786.260780 hartree
zpe.sumelectthermalfe: -786.329284 hartree
dipole: 0.0709 2.3296 1.0919
dipole: 2.5738
quadrupole: -108.5728 -122.6591 -113.9907
quadrupole: -11.0608 -6.3285 -6.3378
quadrupole: 6.5014 -7.5849 1.0835 -11.0608 -6.3285 -6.3378
hfenergy: -786.6404988 hartree
pointgroup: C01 [X(C16H23N3)]
dipole: -0.0567205 -1.0110019 0.0008352 debye
polarizability: 235.6771498|-7.2757037|177.7187681|17.1528107|16.2661346|143.330337 unknown
InChI: InChI=1S/C16H23N3/c1-14(2)18-16(13-17)8-10-19(11-9-16)12-15-6-4-3-5-7-15/h3-7,14,18H,8-12H2,1-2H3
charge 0 multiplicity 1
42 atoms
N  -0.691532 0.102361 0.719829
N  3.23921 -0.644488 -0.809847
N  2.826647 2.743618 0.062023
C  2.143127 0.143005 -0.205266
C  0.917826 0.081727 -1.173275
C  1.701422 -0.454707 1.162473
C  -0.338869 0.73607 -0.575261
C  0.419333 0.213168 1.695349
C  -1.970944 0.612372 1.269432
C  4.459721 -1.027781 -0.046652
C  2.508655 1.594133 -0.020853
C  -3.188562 0.189765 0.452042
C  5.375515 0.149442 0.384468
C  5.240841 -2.041073 -0.911486
C  -4.28416 1.072228 0.287831
C  -3.26438 -1.108812 -0.11251
C  -5.439994 0.665146 -0.418081
C  -4.414852 -1.5166 -0.822664
C  -5.50925 -0.632016 -0.975768
H  0.728206 -0.98914 -1.366224
H  1.17241 0.569412 -2.133947
H  2.503439 -0.345183 1.915125
H  1.520293 -1.532387 0.995187
H  -0.177943 1.838347 -0.456617
H  -1.18534 0.602697 -1.271519
H  0.11583 -0.292749 2.630901
H  0.637759 1.281807 1.952949
H  3.465138 -0.312659 -1.758093
H  -1.966447 1.727694 1.372149
H  -2.067249 0.203736 2.296153
H  4.116681 -1.554671 0.864313
H  6.252366 -0.234321 0.939207
H  5.745065 0.703456 -0.499256
H  4.850124 0.869237 1.035557
H  4.600692 -2.899572 -1.177837
H  6.129981 -2.411718 -0.371167
H  5.593319 -1.567409 -1.849132
H  -4.232447 2.083476 0.711332
H  -2.40524 -1.778843 0.005507
H  -6.279666 1.359407 -0.537382
H  -4.460702 -2.522692 -1.255644
H  -6.402424 -0.948682 -1.526249
