program: Gaussian 09
title: 000070566
version: EM64L-G09RevD.01
frameworkgroup: C1[X(C16H22N2Si)]
method: RPBEPBE
basis: SDD
operation: Freq
keyword: #p
keyword: freq=noraman
keyword: PBEPBE/SDD
title: #p freq=noraman PBEPBE/SDD
converged: YES YES NO NO
title: Mulliken charges:
elementType: Si N N C C C C C C C C C C C C C C C C H H H H H H H H H H H H H H H H H H H H H H
charge: 1.622947 -0.540918 -0.540670 -0.219359 -0.219371 -0.612638 -0.612585 -0.612622 -0.612666 -0.297829 -0.297735 -0.298336 -0.298352 -0.252836 -0.252838 -0.252798 -0.252729 -0.231370 -0.231375 0.211897 0.206085 0.243803 0.206304 0.211995 0.243528 0.211950 0.206026 0.243798 0.243557 0.206221 0.212075 0.252354 0.252212 0.251800 0.251937 0.225902 0.225891 0.225905 0.225898 0.227475 0.227467
chargesum: 0.00000
title: Mulliken charges with hydrogens summed into heavy atoms:
elementType: Si N N C C C C C C C C C C C C C C C C
charge: 1.622947 -0.540918 -0.540670 -0.219359 -0.219371 0.049146 0.049241 0.049152 0.049187 -0.045475 -0.045523 -0.046536 -0.046415 -0.026933 -0.026946 -0.026894 -0.026832 -0.003896 -0.003908
polarizability: 2.17927177e+02 3.99478712e-03 1.86131175e+02 -2.22104996e-01 -2.51381610e-02 2.06284821e+02
1716.lowfreq: -6.9331 -2.5170 0.0003 0.0007 0.0008 9.5612 18.8208 44.9859 54.3499
frequency: 18.6223 44.9859 54.2995 66.0263 74.7123 87.7947 100.0034 103.1589 112.0617 156.5179 189.6306 209.7454 211.8873 214.4447 224.7470 225.9999 258.8174 273.4929 276.1247 280.2269 304.5343 349.5874 403.6655 404.5405 413.9074 424.4677 440.6303 491.9128 538.0442 595.3010 615.5820 616.1756 676.4146 692.2148 698.6393 714.8215 716.7679 751.1005 755.7744 868.6102 871.5693 938.6549 942.9760 968.9752 974.2779 988.1864 989.1137 991.4982 994.6418 1001.4061 1002.6841 1024.0208 1024.1231 1061.7333 1063.6369 1072.1484 1075.7072 1088.0661 1089.8276 1099.3091 1101.9535 1134.0783 1134.6825 1161.3304 1169.2852 1172.1979 1172.3734 1190.9717 1193.7285 1265.6029 1269.9727 1304.9174 1306.8584 1364.2573 1366.8180 1419.1463 1420.0883 1421.7654 1424.9759 1442.2681 1446.5143 1461.8565 1464.6074 1468.6387 1469.0227 1469.1833 1473.9185 1481.8736 1487.9054 1497.5000 1502.6280 1576.1521 1577.7656 1597.2576 1598.1053 2899.3755 2900.9056 2903.5815 2909.1585 2964.9851 2967.7730 2971.1817 2972.1260 3072.7333 3074.1185 3075.5855 3076.3584 3115.5033 3115.8881 3119.4928 3120.6848 3131.3903 3132.2540 3141.5421 3142.1939 3158.0799 3158.5353
redmass: 3.1338 5.3457 3.9384 3.5284 2.7653 2.3092 2.0754 3.6413 3.2899 2.4829 2.5849 1.1582 1.4340 3.7748 1.2522 2.4444 4.5435 1.7872 3.8989 3.0121 3.5921 2.7204 2.8343 2.8685 2.8037 3.9980 3.8739 3.5117 7.1251 5.1659 6.3669 6.4465 6.4435 6.5848 6.1160 1.8080 1.9077 1.8198 1.7222 1.2423 1.2419 1.3421 1.3449 2.6896 2.7152 5.9793 6.0160 1.3804 1.3726 1.3131 1.3045 2.9960 2.8850 1.3827 1.3700 1.6566 1.6785 1.2147 1.2400 2.7232 2.7219 1.3784 1.3803 5.6751 5.9083 1.0572 1.0555 1.1238 1.1246 2.2331 2.2673 1.4182 1.4032 5.4510 5.6918 1.9184 2.1241 1.1968 1.1266 1.1559 1.1566 1.0453 1.1867 1.6459 1.9490 1.0550 1.0778 1.0491 1.0496 1.0580 1.0514 5.6543 5.6469 5.8851 5.8560 1.0425 1.0423 1.0440 1.0441 1.0920 1.0923 1.0954 1.0956 1.0939 1.0938 1.0945 1.0946 1.0843 1.0843 1.0869 1.0870 1.0917 1.0919 1.0961 1.0961 1.1015 1.1015
irintensity: 0.0000 0.0493 0.0029 0.0000 0.7257 0.2039 1.4270 0.5324 0.0001 3.7646 0.8458 0.6950 1.6950 0.0486 1.2632 0.8677 0.0038 8.2454 0.0311 0.0060 0.0001 20.0658 0.0001 0.1996 5.1857 27.2557 1.0849 30.1685 91.0256 54.7387 1.4973 0.0001 70.6899 38.5299 19.4275 68.4256 66.5906 11.7616 25.9936 0.0000 0.0879 0.1736 0.0973 163.7708 167.6064 1.2693 0.2849 0.0002 0.7548 0.0451 0.3786 0.0119 3.5060 0.0068 17.8694 0.0001 5.3662 0.0011 3.4669 38.5259 38.0619 2.0115 0.0012 0.0427 131.6853 0.0004 0.2803 2.4631 3.3348 17.1643 29.4323 0.0000 7.8202 0.0006 1.6598 0.0052 27.0118 0.0004 1.3752 0.8973 1.3988 0.0045 13.4594 1.6133 14.6764 8.4919 15.9544 0.0037 34.2404 2.6543 0.1892 0.0001 0.0108 0.0172 0.1089 0.4951 119.1315 80.3814 359.5292 181.7949 37.5155 0.2002 12.2893 0.2834 48.3719 33.6866 27.4285 1.6668 0.9513 0.0003 0.0306 9.2442 8.5277 0.0535 86.1394 46.2533 24.4789
temp: 298.150 k
press: 1.00000 atm
elementType: 14 7 7 6 6 6 6 6 6 6 6 6 6 6 6 6 6 6 6 1 1 1 1 1 1 1 1 1 1 1 1 1 1 1 1 1 1 1 1 1 1
symmnumber: 1
zpe: 897511.4 jmol-1
zpe.correction: 0.341844 hartree
zpe.thermalcorrener: 0.362488 hartree
zpe.thermalcorrenthalpy: 0.363432 hartree
zpe.thermalcorrgfe: 0.291908 hartree
zpe.sumelectzpe: -1020.393435 hartree
zpe.sumelectthermal: -1020.372791 hartree
zpe.sumelectthermalent: -1020.371847 hartree
zpe.sumelectthermalfe: -1020.443372 hartree
dipole: -0.0009 0.6707 -0.0037
dipole: 0.6707
quadrupole: -116.2871 -118.5769 -112.2750
quadrupole: 0.0028 -0.0322 -0.0067
quadrupole: -0.5741 -2.8639 3.4380 0.0028 -0.0322 -0.0067
hfenergy: -1020.7352793 hartree
pointgroup: C01 [X(C16H22N2Si1)]
dipole: -0.0029004 -0.2638732 0.0004754 debye
polarizability: 217.9281315|-0.3159331|186.1347868|0.0398137|-0.1011996|206.2802549 unknown
InChI: InChI=1S/C16H22N2Si/c1-17(2)19(18(3)4,15-11-7-5-8-12-15)16-13-9-6-10-14-16/h5-14H,1-4H3
charge 0 multiplicity 1
41 atoms
Si -0.011464 -0.901019 -0.004121
N  0.006135 -1.845396 1.517499
N  -0.046886 -1.830933 -1.534588
C  -1.562296 0.215551 0.026441
C  1.560537 0.185709 -0.025623
C  -1.212137 -2.483721 2.051092
C  1.228083 -2.519031 1.997071
C  1.158872 -2.491199 -2.070234
C  -1.281446 -2.477377 -2.01945
C  -2.12982 0.704366 -1.182478
C  2.137795 0.653145 1.187067
C  -2.084618 0.703469 1.255858
C  2.091688 0.673882 -1.251185
C  -3.199496 1.627988 -1.165289
C  3.224965 1.556218 1.177218
C  -3.154215 1.627088 1.278965
C  3.178706 1.577053 -1.266945
C  -3.717904 2.089328 0.067029
C  3.751545 2.018151 -0.051396
H  -1.238438 -2.412088 3.159476
H  -1.267271 -3.56519 1.788132
H  -2.118814 -1.992386 1.659252
H  1.241825 -3.60085 1.730087
H  1.303943 -2.451326 3.103381
H  2.130497 -2.051727 1.567579
H  1.186672 -2.415764 -3.178294
H  1.192819 -3.574603 -1.811472
H  2.074834 -2.019012 -1.676399
H  -2.174931 -1.995482 -1.587492
H  -1.316459 -3.560515 -1.759797
H  -1.354849 -2.400678 -3.125319
H  -1.721079 0.367899 -2.143211
H  1.723121 0.316227 2.14509
H  -1.640935 0.366645 2.200831
H  1.641379 0.353334 -2.198698
H  -3.622266 1.991131 -2.109274
H  3.655032 1.903028 2.124045
H  -3.541683 1.989558 2.238234
H  3.572729 1.940247 -2.223271
H  -4.546494 2.806913 0.082659
H  4.593625 2.719966 -0.061369
