program: Orca
programVersion: 5.0.4
elementType: C H H H
charge: 0
multiplicity: 2
keywords: RIJCOSX NumFreq CCSD(T) NUMGRAD cc-pVtz cc-pVtz/C
frequency: 0.00 0.00 0.00 0.00 0.00 0.00 497.16 1426.80 1427.39 3119.39 3299.66 3300.26
frequency: 497.16 1426.80 1427.39 3119.39 3299.66 3300.26
formula: CH3
InChI: InChI=1/CH3/h1H3
4 atoms
C  -5.591936 1.965132 -0.064666
H  -4.574724 2.311962 0.027311
H  -6.100128 1.55067 0.791821
H  -6.100123 2.031446 -1.013885
totalener: -39.57757736 hartree
nucrepener: 9.67998733 hartree
electener: -49.25756469 hartree
oneelecener: -71.59279201 hartree
twoeener: 22.33522731 hartree
kineticenergy: 39.53084840 hartree
s2: 0.761706
energy: -305.6673 -25.7732 -15.7805 -15.7780 -10.4651 4.0833 6.0476 6.0485 10.2512 10.2540 11.9905 13.2953 16.9057 18.1000 18.1035 19.9224 19.9261 28.0375 29.0452 29.7026 29.7061 31.5285 34.4944 34.4982 39.2500 39.2526 42.0790 42.0809 49.4374 64.3525 64.9635 69.1031 69.1040 77.3083 77.3088 79.1393 79.1430 86.1181 86.9315 87.5952 87.9163 87.9270 89.0809 89.0960 95.1839 96.3820 100.3577 100.3618 106.5360 106.5412 107.7095 107.7122 113.4281 114.8192 114.8704 116.4364 116.4390 119.9509 119.9565 135.9902 140.9981 141.0118 141.8258 142.1456 142.1572 144.2513 144.2606 160.9421 163.9314 163.9476 178.6028 361.9780 electronvolt
energy: -305.0433 -23.2968 -15.3958 -15.3932 3.3211 4.3603 6.1703 6.1713 10.3289 10.3315 14.5602 15.3518 17.6097 18.3675 18.3705 21.2812 21.2837 27.9592 29.8527 29.8564 30.3335 32.0906 35.1591 35.1637 39.3736 39.3763 42.2499 42.2517 49.9017 65.2165 66.9819 69.5314 69.5327 77.9148 77.9157 80.2009 80.2055 86.1732 88.0152 88.2592 88.2682 89.4466 90.1481 90.1578 95.2592 96.5483 100.3917 100.3957 106.6546 106.6599 107.9638 107.9666 113.3492 114.8678 114.9007 116.3632 116.3662 120.1053 120.1112 136.2556 141.1067 141.1207 142.0375 142.2036 142.2141 144.7941 144.8036 161.1463 164.0521 164.0682 178.6881 362.4659 electronvolt
e0: -39.577577629 hartree
ecorr: -0.178769474 hartree
corrType: UHF
chargesum: 0.0000000
charge: -0.434420 0.144773 0.144748 0.144899
charge: 0.214656 -0.071588 -0.071544 -0.071524
qa: -0.4344 0.1448 0.1447 0.1449
va: 3.9703 0.9907 0.9909 0.9906
energy: -39.761065290170 hartree
dipole: 0.00062 -0.00043 0.00019 -0.00099 0.00059 -0.00040 -0.00057 0.00042 -0.00015
magnitude: 0.00047 au
magnitude: 0.00119 debye
dipolemethod: MDCI
temp: 298.15 k
press: 1.00 atm
zeropoint: 0.02977715 hartree
thermalvibcorrection: 0.00023953 hartree
thermalrotcorrection: 0.00141627 hartree
thermaltrasncorrection: 0.00141627 hartree
thermaltotal: -39.72821606 hartree
thermalcorr: 0.00307208 hartree
nonthermalcorr: 0.02977715 hartree
totalcorr: 0.03284923 hartree
thermalcorrenthalpy: 0.00094421 hartree
totalenthalpy: -39.72727185 hartree
vibrat: 0.00033180 hartree
rotat: 0.00663745 hartree
transl: 0.01618771 hartree
total: 0.02381142 hartree
totalentropycorr: -0.02381142 hartree
gibbsenthalpy: -39.75108327 hartree
gibbsminuselec: 0.00998202 hartree
