program: Orca
programVersion: 5.0.4
elementType: C H H H
charge: 0
multiplicity: 2
keywords: Opt RIJCOSX NoFrozenCore MP2 def2-SVP def2-SVP/C
formula: CH3
InChI: InChI=1/CH3/h1H3
4 atoms
C  -5.59223 1.966034 -0.064369
H  -4.568621 2.313656 0.027617
H  -6.103164 1.547876 0.79669
H  -6.102895 2.031643 -1.019358
totalener: -39.49244320 hartree
nucrepener: 10.38660854 hartree
electener: -49.87905174 hartree
oneelecener: -72.73001629 hartree
twoeener: 22.85096455 hartree
kineticenergy: 39.65993419 hartree
s2: 0.759271
s2: 0.760850
total: -39.658465643 hartree
s2: 0.761184
s2: 0.761548
s2: 0.761498
s2: 0.761413
s2: 0.761367
s2: 0.761362
s2: 0.761363
energy: -305.9123 -25.3991 -15.7278 -15.7251 -10.5072 5.3167 7.2904 7.2911 16.8774 16.8818 17.5240 18.2839 23.1768 25.4172 25.4208 39.0633 39.0700 47.5104 50.9405 50.9529 54.5552 57.4162 68.5829 68.5868 69.2820 69.2946 86.6625 88.9493 88.9642 electronvolt
energy: -305.2298 -22.9249 -15.3174 -15.3143 3.8522 5.7692 7.4879 7.4885 16.9987 17.0035 18.6804 22.3095 24.0873 25.7860 25.7894 40.4493 40.4546 47.3825 51.0130 51.0249 54.8844 59.6639 69.4001 69.4127 70.0663 70.0720 87.0740 89.2824 89.2980 electronvolt
chargesum: -0.0000000
charge: -0.208746 0.069627 0.069779 0.069340
charge: -0.047706 0.015888 0.015947 0.015872
qa: -0.2087 0.0696 0.0698 0.0693
va: 4.0323 0.9926 0.9926 0.9928
energy: -39.662452131604 hartree
dipole: 0.00151 -0.00117 0.00034 -0.00369 0.00243 -0.00127 -0.00146 0.00057 -0.00089
magnitude: 0.00158 au
magnitude: 0.00403 debye
dipolemethod: MP2 RELAXED
