program: Orca
programVersion: 5.0.4
elementType: C H H H H
charge: 0
multiplicity: 1
keywords: Opt RIJCOSX CCSD(T) NUMGRAD cc-pVtz cc-pVtz/C
formula: CH4
InChI: InChI=1/CH4/h1H4
5 atoms
C  -4.520187 2.792097 -0.007575
H  -3.480041 3.058837 -0.188428
H  -5.036354 3.634129 0.451074
H  -4.563741 1.932603 0.65961
H  -5.000487 2.542874 -0.952531
totalener: -40.21330808 hartree
nucrepener: 13.40833246 hartree
electener: -53.62164054 hartree
oneelecener: -79.67980771 hartree
twoeener: 26.05816717 hartree
kineticenergy: 40.13649360 hartree
e0: -40.213308288 hartree
ecorr: -0.218569126 hartree
e0: -40.213451886 hartree
ecorr: -0.218473191 hartree
energy: -304.9493 -25.6597 -14.8264 -14.8260 -14.8255 3.9089 6.2422 6.2425 6.2428 9.9128 9.9138 9.9140 17.4701 17.6276 17.6287 17.6289 18.6317 18.6333 20.5804 29.2781 29.2791 29.2793 31.5152 31.5172 31.5174 35.8933 35.8949 35.8959 41.7530 41.7538 41.7557 43.5027 43.5051 49.1571 65.9670 65.9686 65.9688 69.8178 81.3713 81.3726 81.3749 85.3510 85.3546 85.4373 85.4381 85.4393 90.0233 90.0258 90.0271 98.4679 98.4688 98.4697 101.7401 101.7454 101.7463 103.4213 103.4220 105.6009 111.4823 111.4842 111.4851 112.2228 112.2234 119.3815 119.3841 119.3846 123.4704 123.4723 123.4734 131.6324 137.6515 137.6536 137.6565 149.3059 149.3077 149.3092 149.9427 149.9454 149.9523 151.5539 153.5265 153.5302 169.0948 169.0958 169.0975 394.2341 electronvolt
e0: -40.213455017 hartree
ecorr: -0.218470640 hartree
chargesum: 0.0000000
charge: -0.489946 0.122046 0.122676 0.122302 0.122922
charge: 0.118698 -0.029694 -0.029655 -0.029682 -0.029666
qa: -0.4899 0.1220 0.1227 0.1223 0.1229
va: 4.0068 0.9900 0.9891 0.9898 0.9890
energy: -40.438206837920 hartree
dipole: 0.00009 -0.00009 -0.00000 0.00004 -0.00003 0.00001 0.00002 -0.00003 -0.00001
magnitude: 0.00002 au
magnitude: 0.00004 debye
dipolemethod: MDCI
