program: Orca
programVersion: 5.0.4
elementType: C H H H H
charge: 0
multiplicity: 1
keywords: Opt RIJCOSX NoFrozenCore MP2 DEF2-QZVPP DEF2-QZVPP/C
formula: CH4
InChI: InChI=1/CH4/h1H4
5 atoms
C  -4.520203 2.792109 -0.007579
H  -3.48694 3.05706 -0.187219
H  -5.032926 3.628572 0.448068
H  -4.563438 1.938302 0.655187
H  -4.997302 2.544497 -0.946307
totalener: -40.21660792 hartree
nucrepener: 13.40833246 hartree
electener: -53.62494038 hartree
oneelecener: -79.68767051 hartree
twoeener: 26.06273012 hartree
kineticenergy: 40.15137091 hartree
total: -40.451660886 hartree
energy: -304.8261 -25.7319 -14.8801 -14.8797 -14.8792 2.9727 5.0276 5.0279 5.0283 5.8093 5.8097 5.8099 12.8310 13.1389 13.1400 13.1419 14.7490 14.7502 15.4977 21.5087 21.5098 21.5115 22.5686 22.5691 22.5693 24.1914 24.1951 24.1954 29.4259 29.4278 29.4281 31.4729 32.9194 32.9195 32.9398 32.9402 32.9408 37.2193 44.1405 44.1416 44.1425 52.2272 52.2310 55.5491 55.5497 55.5499 57.4783 57.4801 57.4829 61.1984 64.2416 64.2425 64.2436 64.3848 64.3891 64.3915 67.7606 67.7628 73.7929 75.0141 75.0142 75.3301 75.3356 75.3389 80.6578 80.6590 80.6601 85.0086 85.0119 85.0124 87.8584 87.8594 87.8625 87.9436 94.0929 94.1000 94.1043 94.2362 94.2399 94.2451 101.0475 111.0859 111.0983 111.1029 112.7467 112.7481 119.7770 119.7797 119.7864 152.8814 152.8856 155.7580 155.7598 155.7603 162.5852 164.6228 164.6246 164.6279 169.1929 169.8101 169.8120 169.8187 172.4683 172.4687 172.4705 176.6336 176.6348 176.6386 179.7542 182.5900 182.5925 182.5968 187.1115 188.5776 188.5846 188.5875 190.4146 190.4163 199.1444 206.5190 206.5233 206.5255 207.9961 207.9976 210.3008 210.3014 210.3021 215.6993 215.7015 215.7054 217.8721 217.8733 218.8087 218.8116 218.8148 221.2873 221.2885 221.2893 230.2655 232.4655 235.5933 235.5939 237.5694 237.5751 237.5800 238.0846 238.0858 238.0868 238.2763 238.2772 238.2784 249.5221 249.5281 249.5331 254.3657 254.3690 254.3711 267.5364 267.5397 274.4390 274.4410 274.4477 278.0280 278.0289 285.0981 285.1032 285.1096 287.7645 298.4862 298.4872 298.4889 325.0890 325.1008 325.1086 388.3784 818.8053 4096.5812 electronvolt
chargesum: 0.0000000
charge: -0.406838 0.102409 0.101711 0.102023 0.100694
charge: 0.323643 -0.080890 -0.080912 -0.080908 -0.080934
qa: -0.4068 0.1024 0.1017 0.1020 0.1007
va: 4.0297 1.0090 1.0100 1.0094 1.0099
energy: -40.451663301907 hartree
dipole: 0.00014 0.00021 0.00035 -0.00000 -0.00004 -0.00004 0.00003 0.00016 0.00019
magnitude: 0.00040 au
magnitude: 0.00102 debye
dipolemethod: MP2 RELAXED
