program: Orca
programVersion: 5.0.4
elementType: C H H H H
charge: 0
multiplicity: 1
keywords: RIJCOSX NumFreq NoFrozenCore MP2 DEF2-QZVPP DEF2-QZVPP/C
frequency: 0.00 0.00 0.00 0.00 0.00 0.00 1349.58 1349.75 1349.85 1584.19 1584.43 3086.26 3225.42 3225.50 3225.60
frequency: 1349.58 1349.75 1349.85 1584.19 1584.43 3086.26 3225.42 3225.50 3225.60
formula: CH4
InChI: InChI=1/CH4/h1H4
5 atoms
C  -4.520203 2.792109 -0.007579
H  -3.48694 3.05706 -0.187219
H  -5.032926 3.628572 0.448068
H  -4.563438 1.938302 0.655187
H  -4.997302 2.544497 -0.946307
totalener: -40.21692063 hartree
nucrepener: 13.53814429 hartree
electener: -53.75506492 hartree
oneelecener: -79.93362715 hartree
twoeener: 26.17856224 hartree
kineticenergy: 40.21180075 hartree
energy: -304.8260 -25.7318 -14.8800 -14.8797 -14.8791 2.9728 5.0276 5.0279 5.0283 5.8093 5.8097 5.8099 12.8310 13.1389 13.1401 13.1420 14.7490 14.7502 15.4977 21.5087 21.5098 21.5115 22.5687 22.5691 22.5693 24.1914 24.1951 24.1954 29.4259 29.4278 29.4281 31.4729 32.9194 32.9195 32.9398 32.9402 32.9409 37.2193 44.1405 44.1417 44.1425 52.2273 52.2311 55.5491 55.5498 55.5500 57.4783 57.4801 57.4829 61.1984 64.2416 64.2426 64.2437 64.3849 64.3891 64.3915 67.7606 67.7628 73.7929 75.0141 75.0142 75.3301 75.3357 75.3390 80.6578 80.6590 80.6601 85.0086 85.0119 85.0124 87.8584 87.8594 87.8626 87.9436 94.0929 94.1000 94.1043 94.2363 94.2399 94.2451 101.0475 111.0860 111.0984 111.1030 112.7467 112.7481 119.7770 119.7797 119.7865 152.8815 152.8857 155.7581 155.7599 155.7604 162.5853 164.6229 164.6247 164.6279 169.1929 169.8102 169.8120 169.8188 172.4683 172.4687 172.4706 176.6336 176.6348 176.6387 179.7542 182.5901 182.5926 182.5969 187.1115 188.5777 188.5847 188.5876 190.4146 190.4164 199.1445 206.5191 206.5233 206.5256 207.9961 207.9977 210.3009 210.3015 210.3022 215.6994 215.7016 215.7054 217.8721 217.8734 218.8087 218.8117 218.8149 221.2874 221.2886 221.2894 230.2656 232.4656 235.5934 235.5940 237.5695 237.5752 237.5801 238.0847 238.0858 238.0869 238.2763 238.2772 238.2784 249.5222 249.5282 249.5331 254.3658 254.3691 254.3711 267.5365 267.5397 274.4391 274.4411 274.4478 278.0281 278.0289 285.0982 285.1033 285.1097 287.7646 298.4863 298.4873 298.4890 325.0890 325.1008 325.1086 388.3785 818.8054 4096.5814 electronvolt
chargesum: 0.0000000
charge: -0.406841 0.102410 0.101712 0.102024 0.100695
charge: 0.323643 -0.080890 -0.080911 -0.080908 -0.080934
qa: -0.4068 0.1024 0.1017 0.1020 0.1007
va: 4.0297 1.0090 1.0100 1.0094 1.0099
energy: -40.451660336790 hartree
dipole: 0.00014 0.00021 0.00035 -0.00000 -0.00004 -0.00004 0.00003 0.00016 0.00019
magnitude: 0.00040 au
magnitude: 0.00102 debye
dipolemethod: MP2 RELAXED
temp: 298.15 k
press: 1.00 atm
zeropoint: 0.04551912 hartree
thermalvibcorrection: 0.00003434 hartree
thermalrotcorrection: 0.00141627 hartree
thermaltrasncorrection: 0.00141627 hartree
thermaltotal: -40.40327434 hartree
thermalcorr: 0.00286688 hartree
nonthermalcorr: 0.04551912 hartree
totalcorr: 0.04838600 hartree
thermalcorrenthalpy: 0.00094421 hartree
totalenthalpy: -40.40233013 hartree
vibrat: 0.00003946 hartree
rotat: 0.00647859 hartree
transl: 0.01627961 hartree
total: 0.02279766 hartree
totalentropycorr: -0.02279766 hartree
gibbsenthalpy: -40.42512779 hartree
gibbsminuselec: 0.02653255 hartree
