program: Orca
programVersion: 5.0.4
elementType: C H
charge: 0
multiplicity: 2
keywords: Opt RIJCOSX NoFrozenCore MP2 def2-SVP def2-SVP/C
formula: CH
InChI: InChI=1/CH/h1H
2 atoms
C  -4.702799 2.493303 -0.136222
H  -4.954721 2.931307 -1.137308
totalener: -38.23355469 hartree
nucrepener: 2.93244759 hartree
electener: -41.16600227 hartree
oneelecener: -56.72328751 hartree
twoeener: 15.55728524 hartree
kineticenergy: 38.20049895 hartree
s2: 0.755819
s2: 0.756067
total: -38.314495622 hartree
s2: 0.756078
s2: 0.756079
energy: -308.1886 -23.6180 -12.7666 -11.5518 1.2544 5.7836 15.4465 17.5162 17.5637 19.7601 23.2965 40.5765 41.1653 52.5123 52.5218 57.1730 64.5483 64.7677 84.0835 electronvolt
energy: -307.5085 -21.1292 -11.6470 1.9086 3.4165 6.0874 16.1928 17.9933 20.2263 21.6121 23.7599 41.2375 41.9714 54.9908 55.1168 57.9678 64.9708 66.0837 84.4297 electronvolt
chargesum: 0.0000000
charge: -0.046351 0.046351
charge: 0.021898 -0.021898
qa: -0.0464 0.0464
va: 2.0496 0.9334
energy: -38.314497184173 hartree
dipole: -0.21805 0.07623 -0.14182 0.37911 -0.13242 0.24669 -0.86648 0.30267 -0.56381
magnitude: 0.63155 au
magnitude: 1.60527 debye
dipolemethod: MP2 RELAXED
