program: Orca
programVersion: 5.0.4
elementType: C H
charge: 0
multiplicity: 2
keywords: SP CCSD(T) aug-cc-pVQZ def2-TZVP/C def2/J TightSCF
keywords: NoFrozenCore
formula: CH
InChI: InChI=1/CH/h1H
2 atoms
C  0.019504 -0.033911 0.077507
H  -0.232417 0.404092 -0.92358
totalener: -38.28393971 hartree
nucrepener: 2.83139727 hartree
electener: -41.11533697 hartree
oneelecener: -56.60269624 hartree
twoeener: 15.48735926 hartree
kineticenergy: 38.26147658 hartree
s2: 0.759744
energy: -308.2098 -23.9241 -12.8774 -11.5794 0.5011 0.7149 2.1978 2.2644 2.8258 3.4660 5.2768 5.9373 5.9670 6.3527 6.3582 7.7256 7.8640 8.0077 9.2519 11.6105 12.1608 13.1565 14.9886 17.1052 17.1888 17.9937 17.9938 20.1883 20.5725 20.5730 21.0405 21.2352 21.2753 22.6702 22.7072 24.2719 25.0463 25.0580 25.0779 25.1846 29.5119 34.3490 34.7302 39.1651 45.1732 45.1745 45.7875 45.9977 46.4330 52.0913 52.6270 52.6467 53.4921 53.5170 57.6405 57.6664 57.6681 58.0265 58.0351 59.3187 59.4149 61.4132 61.4219 61.7496 61.7499 62.4666 64.6915 65.0499 65.5959 65.6045 65.6067 65.8316 66.0764 72.2549 72.4487 79.3912 87.5043 94.5583 94.8881 96.1950 96.2040 108.8940 112.2262 112.5048 112.6975 159.3247 159.3596 159.5688 159.7833 160.6478 160.6512 161.3001 161.3007 162.5025 168.7667 169.1166 169.9709 170.4846 173.5735 173.5807 176.0875 176.0881 176.3825 178.9023 178.9573 182.5496 184.3714 184.3714 196.7740 198.6494 199.0417 208.4266 208.4282 224.0624 224.2914 226.0743 242.9064 242.9085 248.4021 253.8741 254.1290 270.7457 271.1469 281.5590 329.0597 627.7856 electronvolt
energy: -307.5791 -21.3596 -11.8432 0.7427 0.8044 1.4667 2.2883 3.0485 3.5864 3.8988 5.3461 5.9754 6.2211 6.5164 6.5323 7.7648 8.0464 8.2686 9.4982 11.7693 13.4067 14.3035 15.2742 17.1900 17.5582 18.2723 18.2851 20.4954 20.8004 20.8015 21.1855 21.8889 22.0109 22.7180 23.2313 24.3506 25.0951 25.3959 25.4348 25.5316 29.7849 34.8422 35.4987 39.4038 45.2940 45.2967 46.1387 46.5181 46.9035 52.2401 52.7605 52.7808 53.6420 54.5721 58.0409 58.0419 58.1104 58.7002 58.7183 59.5645 60.4297 62.2882 62.4596 62.4665 62.5546 63.1342 64.7202 65.4391 65.6607 65.9086 65.9199 66.2012 66.6701 72.3014 72.9838 79.8053 87.7239 94.5660 95.1044 96.4235 96.4476 109.0438 112.3293 112.9628 113.1562 159.6555 159.7448 159.7718 160.8826 161.1282 161.3407 162.0270 162.0315 162.8579 168.9194 169.9262 170.0977 171.2878 174.5894 174.6290 176.7775 177.1711 177.1796 179.7245 179.9388 182.8350 184.5012 184.5014 196.9033 198.8288 199.9577 208.6078 208.6146 224.0353 224.3812 226.1210 242.9178 242.9209 248.4946 253.8516 254.2021 270.7863 271.4323 281.6111 329.1242 628.1937 electronvolt
e0: -38.283939809 hartree
ecorr: -0.158400439 hartree
corrType: UHF
chargesum: 0.0000000
charge: -0.279015 0.279015
charge: 0.705606 -0.705606
qa: -0.2790 0.2790
va: 2.1673 0.8462
energy: -38.446439864574 hartree
dipole: -0.21805 0.09210 -0.12595 0.37911 -0.16013 0.21898 -0.86648 0.36598 -0.50049
magnitude: 0.56063 au
magnitude: 1.42502 debye
dipolemethod: MDCI
