program: Orca
programVersion: 5.0.4
elementType: C
charge: 0
multiplicity: 3
keywords: RIJCOSX NoFrozenCore MP2 DEF2-QZVPP DEF2-QZVPP/C
formula: C
InChI: InChI=1/C
1 atoms
C  -4.69274 2.56432 -0.17557
totalener: -37.69362636 hartree
nucrepener: 0.00000000 hartree
electener: -37.69362636 hartree
oneelecener: -50.45129259 hartree
twoeener: 12.75766623 hartree
kineticenergy: 37.69443845 hartree
s2: 2.010167
energy: -308.7212 -22.5597 -11.9439 -11.9439 0.6803 5.7747 5.7747 6.9469 7.8916 16.4991 16.4991 16.7892 16.7892 16.9156 24.8071 24.8071 25.9565 45.9028 51.2915 51.3408 51.3408 51.4873 51.4873 51.7272 51.7272 55.9163 55.9163 56.2406 56.2406 56.3721 84.2362 84.2362 84.7867 138.1154 138.1824 138.1824 138.3835 138.3835 138.7197 138.7197 139.1920 139.1921 168.9357 169.0266 169.0267 169.2995 169.2997 169.7532 169.7533 170.2718 170.3474 170.3474 170.5815 170.5815 195.9776 748.6135 4023.4438 electronvolt
energy: -307.4967 -15.8766 1.4241 2.5626 2.5626 7.4664 8.4870 8.4870 8.9005 17.6564 17.8694 17.8694 18.5782 18.5782 26.5726 27.8301 27.8301 47.6810 52.0213 52.1749 52.1749 52.6385 52.6385 53.4257 53.4257 57.8472 58.2431 58.2431 59.5363 59.5363 85.4119 86.8860 86.8860 138.8494 138.9678 138.9678 139.3247 139.3247 139.9254 139.9255 140.7799 140.7799 169.9941 170.2171 170.2171 170.8897 170.8897 171.4371 171.8855 171.8855 172.0250 172.0250 173.2370 173.2370 197.3478 749.1719 4023.5805 electronvolt
chargesum: -0.0000000
charge: -0.000000
total: -37.785828303 hartree
energy: -37.785828303243 hartree
dipole: 0.00000 0.00000 0.00000 0.00000 0.00001 0.00001 0.00000 -0.00000 -0.00000
magnitude: 0.00001 au
magnitude: 0.00002 debye
