program: Orca
programVersion: 5.0.4
elementType: C H H
charge: 0
multiplicity: 3
keywords: Opt RIJCOSX CCSD(T) NUMGRAD def2-TZVP def2-TZVP/C
formula: CH2
InChI: InChI=1/CH2/h1H2
3 atoms
C  -6.56774 2.612318 0.029286
H  -5.488591 2.625954 -0.019344
H  -7.349229 2.813718 -0.688963
totalener: -38.93758299 hartree
nucrepener: 6.17793459 hartree
electener: -45.11551758 hartree
oneelecener: -63.95570177 hartree
twoeener: 18.84018419 hartree
kineticenergy: 38.91949050 hartree
s2: 2.018119
e0: -38.937582867 hartree
ecorr: -0.132284554 hartree
corrType: UHF
s2: 2.017774
e0: -38.937746030 hartree
ecorr: -0.132310849 hartree
s2: 2.016818
e0: -38.938020712 hartree
ecorr: -0.132211951 hartree
s2: 2.016422
e0: -38.938137947 hartree
ecorr: -0.132126430 hartree
s2: 2.016355
e0: -38.938173320 hartree
ecorr: -0.132096963 hartree
s2: 2.016359
energy: -306.5492 -25.8000 -16.7992 -12.2852 -11.1452 4.6824 6.0132 8.1106 8.8264 9.1326 9.2690 16.0864 18.7716 21.2207 21.9911 22.0839 28.5038 29.0710 41.1603 45.3035 46.2459 48.7151 54.3155 54.4460 59.0841 60.1003 65.9855 67.6660 75.5762 78.5436 80.2913 80.8320 88.1557 88.6479 88.7227 91.4492 93.1167 96.3272 102.5598 103.3031 118.9389 127.6922 618.5401 electronvolt
energy: -305.2434 -21.1339 -15.9746 2.7891 3.3259 5.1942 6.3924 8.7638 9.6951 12.1494 12.8302 17.1450 20.1630 23.1227 25.0727 25.2824 29.4252 30.2224 43.1715 48.5058 49.0146 49.6464 54.8309 54.9260 59.6617 60.4384 66.6265 67.9138 76.4677 79.3457 82.6228 83.1542 90.5399 92.1493 92.1585 92.8122 94.6721 97.5499 103.8031 104.0307 120.0357 128.3287 619.5219 electronvolt
e0: -38.938175683 hartree
ecorr: -0.132095018 hartree
chargesum: -0.0000000
charge: -0.320672 0.160345 0.160327
charge: -0.176097 0.088045 0.088052
qa: -0.3207 0.1603 0.1603
va: 3.9457 0.9753 0.9753
energy: -39.073399444084 hartree
dipole: 0.23912 -0.14891 0.09021 0.17275 -0.10756 0.06518 -0.61606 0.38366 -0.23240
magnitude: 0.25768 au
magnitude: 0.65496 debye
dipolemethod: MDCI
