program: Orca
programVersion: 5.0.4
elementType: C H H H H
charge: 0
multiplicity: 1
keywords: Opt RIJCOSX CCSD(T) NUMGRAD def2-TZVP def2-TZVP/C
formula: CH4
InChI: InChI=1/CH4/h1H4
5 atoms
C  -4.520168 2.792105 -0.007576
H  -3.477888 3.059383 -0.188786
H  -5.037422 3.635829 0.451987
H  -4.563834 1.930849 0.660964
H  -5.001498 2.542373 -0.954439
totalener: -40.21296112 hartree
nucrepener: 13.40833246 hartree
electener: -53.62129358 hartree
oneelecener: -79.67822918 hartree
twoeener: 26.05693560 hartree
kineticenergy: 40.14675383 hartree
e0: -40.212961328 hartree
ecorr: -0.209320779 hartree
e0: -40.213009924 hartree
ecorr: -0.209281674 hartree
energy: -304.9681 -25.6292 -14.8184 -14.8182 -14.8179 4.0670 6.4430 6.4433 6.4435 8.5377 8.5378 8.5381 13.7862 17.9635 17.9639 17.9647 19.7995 21.4041 21.4066 30.5452 30.5492 30.5511 46.9241 48.2969 48.2987 48.2996 49.1360 49.1363 49.1365 61.5613 62.0714 62.0725 62.0749 69.5912 69.5923 69.5943 73.0159 73.0209 78.3874 78.3896 78.3905 90.0329 90.6593 90.6609 100.4999 100.5013 100.5025 104.3617 104.3630 104.3663 124.6142 124.6195 124.6214 131.6250 633.6618 electronvolt
e0: -40.213011003 hartree
ecorr: -0.209280757 hartree
chargesum: -0.0000000
charge: -0.518843 0.129722 0.129684 0.129732 0.129705
charge: -0.415393 0.103851 0.103848 0.103850 0.103844
qa: -0.5188 0.1297 0.1297 0.1297 0.1297
va: 4.0650 0.9783 0.9783 0.9782 0.9782
energy: -40.427996001124 hartree
dipole: 0.00002 -0.00002 0.00000 0.00001 0.00002 0.00004 0.00002 -0.00000 0.00002
magnitude: 0.00004 au
magnitude: 0.00010 debye
dipolemethod: MDCI
