program: Orca
programVersion: 5.0.4
elementType: C H H H H
charge: 0
multiplicity: 1
keywords: RIJCOSX NumFreq CCSD(T) NUMGRAD def2-TZVP def2-TZVP/C
frequency: 0.00 0.00 0.00 0.00 0.00 0.00 1353.79 1354.05 1354.27 1571.11 1571.46 3029.19 3149.69 3149.72 3149.77
frequency: 1353.79 1354.05 1354.27 1571.11 1571.46 3029.19 3149.69 3149.72 3149.77
formula: CH4
InChI: InChI=1/CH4/h1H4
5 atoms
C  -4.520168 2.792105 -0.007576
H  -3.477888 3.059383 -0.188786
H  -5.037422 3.635829 0.451987
H  -4.563834 1.930849 0.660964
H  -5.001498 2.542373 -0.954439
totalener: -40.21301079 hartree
nucrepener: 13.42120183 hartree
electener: -53.63421262 hartree
oneelecener: -79.70263993 hartree
twoeener: 26.06842731 hartree
kineticenergy: 40.15269784 hartree
energy: -304.9682 -25.6292 -14.8184 -14.8182 -14.8179 4.0671 6.4430 6.4433 6.4435 8.5377 8.5378 8.5381 13.7863 17.9635 17.9639 17.9647 19.7995 21.4041 21.4066 30.5452 30.5492 30.5511 46.9241 48.2969 48.2987 48.2996 49.1360 49.1363 49.1365 61.5614 62.0714 62.0725 62.0749 69.5912 69.5923 69.5943 73.0159 73.0209 78.3874 78.3896 78.3905 90.0329 90.6593 90.6609 100.4999 100.5013 100.5025 104.3617 104.3630 104.3663 124.6142 124.6195 124.6214 131.6250 633.6618 electronvolt
e0: -40.213011003 hartree
ecorr: -0.209280756 hartree
chargesum: -0.0000000
charge: -0.518843 0.129722 0.129684 0.129732 0.129705
charge: -0.415393 0.103851 0.103848 0.103850 0.103844
qa: -0.5188 0.1297 0.1297 0.1297 0.1297
va: 4.0650 0.9783 0.9783 0.9782 0.9782
energy: -40.427996001897 hartree
dipole: 0.00002 -0.00002 0.00000 0.00001 0.00002 0.00004 0.00002 -0.00000 0.00002
magnitude: 0.00004 au
magnitude: 0.00010 debye
dipolemethod: MDCI
temp: 298.15 k
press: 1.00 atm
zeropoint: 0.04484129 hartree
thermalvibcorrection: 0.00003425 hartree
thermalrotcorrection: 0.00141627 hartree
thermaltrasncorrection: 0.00141627 hartree
thermaltotal: -40.38028792 hartree
thermalcorr: 0.00286679 hartree
nonthermalcorr: 0.04484129 hartree
totalcorr: 0.04770808 hartree
thermalcorrenthalpy: 0.00094421 hartree
totalenthalpy: -40.37934371 hartree
vibrat: 0.00003934 hartree
rotat: 0.00481142 hartree
transl: 0.01627961 hartree
total: 0.02113037 hartree
totalentropycorr: -0.02113037 hartree
gibbsenthalpy: -40.40047408 hartree
gibbsminuselec: 0.02752192 hartree
