program: Orca
programVersion: 5.0.4
elementType: C H H H H
charge: 0
multiplicity: 1
keywords: SP CCSD(T) aug-cc-pVQZ def2-TZVP/C def2/J TightSCF
keywords: NoFrozenCore
formula: CH4
InChI: InChI=1/CH4/h1H4
5 atoms
C  -0.000002 -0.000001 -0.000002
H  1.042279 0.267278 -0.181212
H  -0.517255 0.843724 0.459561
H  -0.043668 -0.861257 0.668539
H  -0.481332 -0.249732 -0.946865
totalener: -40.21610087 hartree
nucrepener: 13.42120187 hartree
electener: -53.63730274 hartree
oneelecener: -79.71072565 hartree
twoeener: 26.07342291 hartree
kineticenergy: 40.15722212 hartree
energy: -304.9570 -25.6275 -14.8139 -14.8137 -14.8135 0.7460 1.2294 1.2294 1.2295 2.8924 2.8924 2.8925 3.3555 5.0308 5.0308 5.0309 5.6299 5.6299 7.2901 7.3854 7.3854 7.3855 7.6244 7.6244 7.6244 7.9525 7.9526 7.9526 9.0461 10.6534 10.6534 10.6534 10.6847 10.6849 14.8780 14.8781 14.8782 15.1026 15.1026 16.4946 18.5647 18.5647 18.5648 19.4260 19.4260 19.4260 19.8837 19.8838 19.8839 20.3357 20.9386 20.9387 20.9388 21.7475 21.7477 21.7478 24.0092 24.0092 24.0093 24.0807 24.7901 24.7901 26.7811 26.7813 29.0572 29.0574 29.0577 30.1822 31.1997 31.1998 31.1999 33.4890 33.4892 33.4893 37.2205 37.2205 37.2206 40.6679 40.6681 40.6683 41.3051 42.3720 42.3721 42.3722 44.9016 44.9016 49.6058 49.6060 49.6064 50.2581 50.2584 50.2587 51.3259 51.7266 51.7268 51.9589 51.9593 51.9599 53.1252 54.4744 54.4745 54.4746 54.5740 54.5744 56.5308 56.5309 56.5312 57.0343 57.0345 57.0348 58.5755 59.1569 60.9663 60.9664 60.9666 62.3550 62.3551 62.3552 65.4405 65.4406 65.4407 72.1114 72.1117 72.1119 73.0401 73.0402 75.9113 75.9114 75.9115 76.1104 76.1202 76.1202 76.1204 81.1706 81.1708 81.8579 81.8580 81.8581 85.4676 85.4678 85.4682 86.8268 91.4514 91.4516 100.0143 100.0147 100.0155 100.2023 100.2024 100.2026 104.9687 105.5544 105.5546 105.5549 108.7178 108.7179 108.7180 112.0183 112.0186 112.0188 113.4009 115.8988 115.8991 116.9084 116.9086 116.9088 117.1653 117.1659 128.2158 128.2167 128.2172 133.9716 133.9722 133.9727 139.9404 165.7155 165.7162 167.6388 167.6390 167.6394 169.6513 169.6514 169.6515 176.5451 182.9704 184.8788 184.8790 184.8792 186.7803 186.7803 186.7804 187.4161 187.4169 187.4177 189.7924 189.7928 189.7940 195.8450 195.8452 195.8453 200.4634 204.4028 206.3687 206.3688 206.3691 211.4142 211.4145 213.3798 213.3809 213.3817 213.8396 213.8398 213.8400 219.3349 219.3352 230.7298 230.7298 230.7299 230.9101 232.8614 232.8639 234.8985 234.8993 234.8998 247.4102 247.4107 247.4109 249.9522 249.9523 249.9524 252.1391 252.1396 252.1398 256.2051 256.2056 256.2065 261.1154 261.1164 264.1047 270.3066 270.3081 273.0863 273.0867 273.0871 278.7888 278.7888 278.7889 279.4242 279.4243 287.4399 287.4407 287.4413 296.6050 297.9940 297.9947 297.9953 312.3408 312.3418 312.3424 357.6395 357.6401 357.6418 375.6323 804.8416 electronvolt
e0: -40.216100873 hartree
ecorr: -0.259036387 hartree
chargesum: 0.0000000
charge: -0.979293 0.244818 0.244821 0.244822 0.244831
charge: 1.275840 -0.318956 -0.318956 -0.318959 -0.318969
qa: -0.9793 0.2448 0.2448 0.2448 0.2448
va: 3.8643 0.9792 0.9792 0.9792 0.9792
energy: -40.482452732905 hartree
dipole: 0.00002 -0.00002 0.00000 0.00001 -0.00001 0.00000 0.00002 -0.00002 0.00000
magnitude: 0.00000 au
magnitude: 0.00000 debye
dipolemethod: MDCI
