program: Gaussian 09
title: 000070597
version: EM64L-G09RevD.01
frameworkgroup: C1[X(C13H36Si4)]
method: RPBEPBE
basis: SDD
operation: Freq
keyword: #p
keyword: freq=noraman
keyword: PBEPBE/SDD
title: #p freq=noraman PBEPBE/SDD
converged: NO YES NO NO
title: Mulliken charges:
elementType: Si Si Si Si C C C C C C C C C C C C C H H H H H H H H H H H H H H H H H H H H H H H H H H H H H H H H H H H H
charge: 1.372663 1.379399 1.376564 1.375578 -1.705679 -1.035913 -1.036732 -1.036496 -1.036710 -1.038348 -1.037238 -1.036378 -1.035844 -1.036752 -1.036354 -1.035943 -1.036696 0.233652 0.231846 0.254466 0.254769 0.233485 0.232214 0.233383 0.231843 0.255422 0.254986 0.232997 0.231971 0.233346 0.232049 0.255471 0.231861 0.255289 0.233412 0.232977 0.231743 0.254661 0.233355 0.231691 0.254513 0.233504 0.231773 0.254865 0.231957 0.254901 0.233000 0.254575 0.233115 0.231655 0.231859 0.254663 0.233610
chargesum: 0.00000
title: Mulliken charges with hydrogens summed into heavy atoms:
elementType: Si Si Si Si C C C C C C C C C C C C C
charge: 1.372663 1.379399 1.376564 1.375578 -1.705679 -0.315950 -0.316263 -0.315848 -0.316756 -0.317482 -0.316676 -0.316998 -0.316285 -0.316609 -0.316496 -0.316599 -0.316564
polarizability: 2.37464186e+02 -3.67651448e-03 2.37361690e+02 -3.01916606e-02 3.68060818e-02 2.37311400e+02
1716.lowfreq: -12.7711 -10.0610 -0.0007 0.0010 0.0023 20.6131 95.5962 99.6875 102.7766
frequency: 95.4337 99.6728 102.7076 113.4859 113.9413 121.0491 126.3062 133.5242 138.6012 145.5631 151.1032 153.8353 158.0539 163.6788 166.3405 167.7575 169.2263 174.0420 179.3089 187.1076 188.8214 191.1937 192.3457 194.1852 197.3963 199.7899 202.0771 206.6453 211.1340 219.9900 222.5207 225.1212 229.5465 248.5201 250.3504 254.7694 275.0290 277.0067 306.8793 307.1334 309.3575 357.0389 587.6745 590.4874 590.6223 629.3955 668.2892 669.0542 669.6705 673.0142 673.6021 674.3338 674.7642 676.1749 707.6893 708.8980 716.0315 734.1186 736.3097 739.4726 745.3038 784.0773 786.9055 788.8152 811.3130 813.3590 839.6390 842.0362 845.5445 886.0829 888.8928 891.4510 898.9931 899.6740 900.7466 906.3551 907.7289 908.7583 912.3974 913.0778 942.2739 1276.2783 1277.6136 1280.4074 1281.9052 1283.8072 1284.5188 1285.8290 1288.3021 1297.6313 1299.2449 1300.3080 1311.7674 1434.4517 1435.7693 1436.1641 1439.8283 1441.4355 1442.6669 1443.9651 1449.4452 1450.8662 1451.7299 1453.1245 1455.6748 1459.0661 1460.1571 1461.8141 1462.4117 1463.1833 1464.6240 1465.6079 1467.0913 1471.9713 1475.7906 1476.1060 1478.0658 2981.2634 2982.6439 2983.4738 2983.6488 2984.0955 2984.4988 2984.7436 2985.1455 2985.4851 2986.3368 2986.8296 2987.5363 3074.6557 3076.3943 3077.4130 3078.1783 3078.3028 3078.9503 3079.5683 3079.7213 3081.2638 3082.1100 3082.4511 3084.5100 3104.9049 3106.4241 3106.5641 3106.8693 3107.9250 3108.0407 3108.7250 3108.9981 3109.3215 3111.3624 3112.7273 3112.9200
redmass: 2.8561 2.3942 2.6649 2.7575 2.3352 2.3227 1.1920 1.0980 1.1171 1.2536 1.3005 1.1547 1.2391 3.1115 1.6694 2.5884 1.9192 2.3805 2.1821 1.9521 2.4325 2.6095 1.8086 2.1629 1.6845 1.8762 1.6634 1.5616 1.6825 1.6318 1.4711 1.6248 2.7157 2.3331 2.2875 2.2822 2.7575 2.7837 3.1577 3.1643 3.1255 3.2992 4.2979 4.3669 4.3491 4.1486 3.6562 3.5866 3.5326 3.2755 3.3999 3.2750 3.3544 3.2321 3.3819 3.2242 3.0718 1.1711 1.1624 1.1628 1.1544 1.3257 1.3251 1.3159 1.3250 1.3323 1.5234 1.5595 1.5453 1.3752 1.3705 1.3826 1.4809 1.4685 1.4688 1.4945 1.5226 1.5784 1.5986 1.6217 1.5481 1.2066 1.2078 1.2061 1.2027 1.1998 1.1996 1.1992 1.1973 1.1892 1.1880 1.1882 1.1820 1.0555 1.0553 1.0554 1.0525 1.0549 1.0543 1.0543 1.0528 1.0529 1.0524 1.0536 1.0532 1.0537 1.0538 1.0509 1.0533 1.0510 1.0516 1.0503 1.0519 1.0491 1.0480 1.0481 1.0479 1.0357 1.0358 1.0359 1.0359 1.0357 1.0360 1.0358 1.0361 1.0358 1.0357 1.0358 1.0358 1.0971 1.0967 1.0964 1.0964 1.0961 1.0959 1.0956 1.0956 1.0956 1.0953 1.0952 1.0945 1.0982 1.0981 1.0983 1.0977 1.0979 1.0981 1.0977 1.0977 1.0976 1.0974 1.0970 1.0970
irintensity: 0.1249 0.0879 0.1071 0.0027 0.0290 0.0207 0.0078 0.0039 0.0207 0.0463 0.0069 0.1022 0.1213 0.2965 0.0493 0.2308 0.1230 0.1489 0.0171 0.0079 0.0206 0.2421 1.3724 0.7903 0.5728 0.5351 1.1601 1.6417 1.7055 1.8706 2.2896 1.9328 0.3057 0.1194 0.1839 0.1084 0.0193 0.1124 2.6406 2.6801 2.4675 0.0060 0.3136 0.7494 0.6757 0.0261 0.5746 0.3459 0.7422 11.7737 16.3738 4.7604 10.3494 8.8356 38.8499 35.5724 29.2104 1.2777 0.6905 0.5006 0.3592 0.7962 1.4194 0.4089 0.0473 0.3317 16.8498 19.5152 18.8064 16.5105 7.0252 32.0717 159.7501 148.3566 169.3962 50.2589 153.3574 212.7334 339.4037 291.7149 0.1708 2.9601 2.3836 0.9343 17.0408 14.9937 27.6523 10.5604 2.1649 118.7516 125.2647 119.6726 3.4347 0.1606 0.2474 0.2618 0.0944 2.2581 1.7261 0.3067 11.1536 11.2199 12.3043 1.1356 0.5257 4.1828 0.6844 2.7086 1.4633 0.2721 5.2192 6.4994 2.6122 2.1690 11.0937 9.9128 11.2368 12.3049 32.5955 13.9981 18.2316 7.4404 28.5907 3.1584 6.3876 33.8984 39.2938 45.5798 7.7366 21.9132 9.3342 6.0136 46.7824 20.9297 23.6814 29.7793 41.7048 23.6243 36.7579 22.6941 0.9934 11.9066 11.1438 3.2276 8.9303 9.6723 5.5631 24.5164 15.8917 10.4912 11.9706 9.6332 10.5770
temp: 298.150 k
press: 1.00000 atm
elementType: 14 14 14 14 6 6 6 6 6 6 6 6 6 6 6 6 6 1 1 1 1 1 1 1 1 1 1 1 1 1 1 1 1 1 1 1 1 1 1 1 1 1 1 1 1 1 1 1 1 1 1 1 1
symmnumber: 1
zpe: 1189346.7 jmol-1
zpe.correction: 0.452998 hartree
zpe.thermalcorrener: 0.483948 hartree
zpe.thermalcorrenthalpy: 0.484892 hartree
zpe.thermalcorrgfe: 0.397585 hartree
zpe.sumelectzpe: -1673.190894 hartree
zpe.sumelectthermal: -1673.159944 hartree
zpe.sumelectthermalent: -1673.159000 hartree
zpe.sumelectthermalfe: -1673.246308 hartree
dipole: -0.0113 -0.0115 0.0108
dipole: 0.0194
quadrupole: -144.1113 -144.1415 -144.1113
quadrupole: 0.0080 0.0069 -0.0053
quadrupole: 0.0101 -0.0202 0.0101 0.0080 0.0069 -0.0053
hfenergy: -1673.6438924 hartree
pointgroup: C01 [X(C13H36Si4)]
dipole: 0.0005265 -0.0070951 -0.0027634 debye
polarizability: 237.4071075|0.0729582|237.348849|0.0116299|0.0450813|237.38132 unknown
InChI: InChI=1S/C13H36Si4/c1-14(2,3)13(15(4,5)6,16(7,8)9)17(10,11)12/h1-12H3
charge 0 multiplicity 1
53 atoms
Si -0.564566 -0.713342 -1.746917
Si -0.078584 -1.433688 1.347396
Si -1.201778 1.462867 0.530706
Si 1.841671 0.674769 -0.128733
C  -0.002502 -0.000781 0.0013
C  -2.473558 -0.901507 -1.916606
C  0.153387 -2.456383 -2.13675
C  -0.035736 0.40222 -3.224496
C  -0.074292 -0.785223 3.159699
C  1.404413 -2.655426 1.238612
C  -1.658001 -2.524969 1.20271
C  -2.899422 0.857489 1.208967
C  -0.476319 2.579285 1.922288
C  -1.62388 2.666361 -0.911643
C  2.70232 0.895412 1.580248
C  1.973372 2.395682 -0.982906
C  3.006916 -0.479481 -1.137655
H  -3.000012 0.068465 -1.894692
H  -2.682581 -1.371512 -2.897333
H  -2.902923 -1.549455 -1.134078
H  1.254629 -2.47538 -2.085142
H  -0.241443 -3.239281 -1.46577
H  -0.142495 -2.721907 -3.170263
H  1.059567 0.442245 -3.356969
H  -0.469651 -0.025285 -4.149138
H  -0.411509 1.433746 -3.119818
H  0.803806 -0.154375 3.377072
H  -0.985832 -0.213601 3.407315
H  -0.036524 -1.662139 3.834871
H  2.365529 -2.177494 1.496676
H  1.231034 -3.472079 1.96614
H  1.498539 -3.109615 0.238293
H  -1.647384 -3.256947 2.03353
H  -2.583185 -1.930515 1.287786
H  -1.695886 -3.094226 0.257701
H  -2.802489 0.303196 2.159254
H  -3.52482 1.749628 1.407531
H  -3.439207 0.220918 0.48813
H  0.422417 3.132491 1.598156
H  -1.246688 3.326382 2.195664
H  -0.224484 2.007842 2.831511
H  -2.197301 2.178441 -1.718922
H  -2.250259 3.483312 -0.503725
H  -0.721623 3.121982 -1.353234
H  3.687442 1.36968 1.404747
H  2.128888 1.550767 2.256844
H  2.883436 -0.064985 2.093734
H  1.537126 2.396924 -1.995911
H  1.494899 3.199597 -0.396404
H  3.048057 2.645989 -1.076624
H  4.027322 -0.050977 -1.100142
H  3.053212 -1.498141 -0.717478
H  2.71605 -0.552974 -2.200034
