program: Gaussian 09
title: 000070488
version: EM64L-G09RevD.01
frameworkgroup: C1[X(C4H7N5O)]
method: RPBEPBE
basis: SDD
operation: Freq
keyword: #pfreq=noraman
keyword: PBEPBE/SDD
title: #p freq=noraman PBEPBE/SDD
converged: NO YES NO NO
title: Mulliken charges:
elementType: O N N N N N C C C C H H H H H H H
charge: -0.301814 -0.438295 -0.042306 -0.692977 -0.692049 -0.634790 0.334937 0.132384 0.165211 -0.011475 0.289994 0.303043 0.318737 0.273851 0.343041 0.301064 0.351443
chargesum: 0.00000
title: Mulliken charges with hydrogens summed into heavy atoms:
elementType: O N N N N N C C C C
charge: -0.301814 -0.148300 -0.042306 -0.071197 -0.075157 0.017717 0.334937 0.132384 0.165211 -0.011475
polarizability: 1.15261256e+02 6.63937753e+00 1.07506156e+02 9.81440411e-03 5.09509151e-03 3.55630518e+01
1716.lowfreq: -388.2472 -315.4702 -141.7430 -10.1385 -4.8023 -0.0004 0.0004 0.0005 5.2907
frequency: -388.2469 -315.4699 -141.7386 96.6419 178.1141 183.6845 202.8748 291.8806 308.8575 336.7891 352.2252 425.4417 462.4410 486.8044 515.5940 538.6175 580.4319 597.7173 616.9649 670.8247 739.0734 772.1319 911.5268 966.6460 1051.5845 1055.3063 1197.0239 1236.5185 1320.7554 1336.2390 1409.1470 1492.1052 1527.7770 1586.8442 1602.3243 1628.6821 1644.7018 1704.3684 3504.2368 3541.5451 3561.0691 3586.9745 3702.3084 3713.9883 3727.7400
redmass: 1.0517 1.0877 1.1690 6.1812 6.3357 1.3067 3.5324 3.0992 2.9688 5.3284 4.9903 1.2205 7.1051 1.1458 8.3820 1.8996 1.8863 3.4002 7.0471 8.8591 11.4939 5.8162 2.0208 2.6849 1.9891 1.5408 4.1595 3.0568 4.4935 1.9133 5.3432 4.0978 4.6588 1.5237 1.5703 2.0456 1.1745 8.0129 1.0499 1.0768 1.0457 1.0468 1.0979 1.1052 1.1026
irintensity: 41.4292 20.1846 13.0740 31.0744 0.5891 357.2348 124.9884 1.6777 8.7870 5.5420 5.2937 377.2045 0.7874 43.0367 2.9093 47.0615 103.4384 0.4019 2.4009 1.5669 11.7836 4.8701 5.5428 3.1300 58.3133 0.6548 36.4114 41.2136 37.1796 80.5729 62.2182 81.3228 744.9203 29.0425 6.2209 597.4269 63.6840 293.1039 63.6356 13.3547 88.6753 53.1728 22.9255 39.0880 23.7254
temp: 298.150 k
press: 1.00000 atm
elementType: 8 7 7 7 7 7 6 6 6 6 1 1 1 1 1 1 1
symmnumber: 1
zpe: 331165.3 jmol-1
zpe.correction: 0.126134 hartree
zpe.thermalcorrener: 0.135233 hartree
zpe.thermalcorrenthalpy: 0.136177 hartree
zpe.thermalcorrgfe: 0.092431 hartree
zpe.sumelectzpe: -504.868774 hartree
zpe.sumelectthermal: -504.859676 hartree
zpe.sumelectthermalent: -504.858732 hartree
zpe.sumelectthermalfe: -504.902478 hartree
dipole: 2.1147 9.7134 0.0021
dipole: 9.9409
quadrupole: -35.9219 -58.6160 -63.4147
quadrupole: -1.5997 0.0143 0.0160
quadrupole: 16.7290 -5.9651 -10.7638 -1.5997 0.0143 0.0160
hfenergy: -504.9949083 hartree
pointgroup: C01 [X(C4H7N5O1)]
dipole: 0.6631776 -3.8544171 -0.0008071 debye
dipolederiv: -0.6570617 0.4149776 0.0001075 0.2911604 -1.2768958 -0.0000873 0.0000441 -0.0000571 -0.4109877 -0.7025886 0.162023 0.0001847 -0.3843913 -0.6605284 -0.0004065 0.0000377 -0.0007348 -0.2215976 -1.1265991 0.2921864 0.0001672 0.4982747 -0.6967851 0.0000176 0.0002085 0.0000461 -0.3080282 -0.3326701 -0.5279404 0.0003337 -0.3443199 -1.2967998 0.0003961 0.0006162 0.0018491 -0.7667801 -1.3029538 0.3203969 -0.0006466 0.0663098 -0.1508553 -0.0008402 -0.0018828 -0.0004729 -0.7687342 -1.6595667 0.0599083 -0.0002482 0.1270996 -0.2009847 0.0004088 -0.0011064 0.0004789 -0.7879991 0.4125807 0.0468338 -0.0001618 0.6368282 1.6034649 0.0002449 0.0000377 0.0005238 0.067364 1.0298725 -0.3927849 -0.0001217 -0.47778 -1.0000969 0.0002635 -0.0002047 0.0002199 0.0388508 1.8929828 -0.1498369 0.0000366 -0.1736279 0.9700838 -0.0000735 0.0003407 -0.0002395 0.236552 1.0943224 -0.2487984 -0.0001715 -0.4051495 1.6680826 0.0001189 0.000112 -0.0001252 0.184192 0.1458053 -0.0016638 -0.0000042 0.0214149 0.0718528 0.0000767 -0.0000985 0.0003935 0.3328369 0.1388037 0.0368789 0.0000356 0.033546 0.1889908 -0.0003014 0.0000394 -0.0010388 0.4074352 0.1445955 0.0679206 -0.0002111 0.0595709 0.1870536 -0.0000622 -0.0005837 -0.0008113 0.4031084 0.1696964 -0.0412435 0.0003088 -0.0503204 0.0841473 0.0004805 0.001236 0.0004346 0.4014721 0.2843347 -0.0731964 0.0002576 0.0432283 0.2241969 0.0000398 0.0004484 -0.0001325 0.3838236 0.2049333 -0.0044509 0.0000539 -0.0089118 0.1047926 -0.0002351 0.0005473 -0.0003306 0.4057515 0.2635127 0.0387897 0.0000794 0.067068 0.1802806 -0.0000406 0.0002082 -0.0000031 0.4027403 unknown
polarizability: 114.6631054|-6.9542984|108.1043069|-0.0095809|0.0055216|35.5630518 unknown
InChI: InChI=1S/C4H7N5O/c5-1-2(6)8-4(7)9-3(1)10/h8H,5-7H2
charge 0 multiplicity 1
17 atoms
O  -0.931753 2.390071 0.000189
N  0.896837 -1.253807 -0.000091
N  1.065711 1.136659 -0.000221
N  -1.162171 -2.465705 -0.00025
N  -2.53061 0.228241 0.000578
N  3.010856 -0.17191 -0.000048
C  -0.516836 -1.220141 -0.00003
C  -1.1500 0.013929 0.000325
C  1.626233 -0.064561 -0.000177
C  -0.339412 1.256199 0.000092
H  1.371079 -2.157563 0.000476
H  -0.649593 -3.34211 -0.001551
H  -2.174107 -2.514414 -0.001813
H  -3.236276 -0.498084 0.002897
H  -2.795832 1.215609 0.000727
H  3.513938 -1.053863 -0.001016
H  3.522738 0.70645 -0.000085
