program: Gaussian 09
title: 000070467
version: EM64L-G09RevD.01
frameworkgroup: C1[X(C9H16O)]
method: RPBEPBE
basis: SDD
operation: Freq
keyword: #pfreq=noraman
keyword: PBEPBE/SDD
title: #p freq=noraman PBEPBE/SDD
converged: YES YES NO NO
title: Mulliken charges:
elementType: O C C C C C C C C C H H H H H H H H H H H H H H H H
charge: -0.180845 0.257930 -0.497129 -0.714259 -0.719227 -0.288069 -0.119137 0.367938 -0.783264 -0.792385 0.212775 0.202014 0.197160 0.243237 0.226392 0.223711 0.233354 0.211263 0.225630 0.157609 0.217711 0.232115 0.216115 0.221986 0.224934 0.222443
chargesum: 0.00000
title: Mulliken charges with hydrogens summed into heavy atoms:
elementType: O C C C C C C C C C
charge: -0.180845 0.257930 -0.082341 -0.047470 -0.050899 -0.062439 0.038472 0.367938 -0.117323 -0.123023
polarizability: 1.22759600e+02 1.18221841e+00 9.56668579e+01 -7.03442460e+00 1.20722619e+00 8.40238603e+01
1716.lowfreq: -13.6653 -4.5923 -0.0004 0.0004 0.0006 8.1998 26.1822 56.6131 59.2163
frequency: 25.7448 56.5978 59.0693 103.0629 120.1272 166.1932 187.1208 223.7569 237.7173 245.2842 291.8064 298.8421 321.8040 367.0335 390.6699 434.5765 471.4104 518.7608 596.3009 755.2468 773.1263 841.3438 885.0211 904.0670 906.2373 943.0006 948.4354 975.3490 994.3019 1012.1224 1030.8435 1082.6479 1121.8651 1138.0960 1156.4416 1192.7987 1227.1394 1290.2794 1296.1723 1367.3774 1374.7337 1382.7902 1389.8228 1396.3247 1400.5054 1449.7325 1455.6683 1459.9683 1463.4240 1468.6132 1473.3457 1476.2162 1476.6997 1483.5792 1640.4433 1696.7987 2818.6360 2946.8118 2959.5632 2966.4111 2971.6295 2987.5845 3031.0378 3034.8054 3037.8169 3066.7930 3070.7458 3079.1347 3082.5996 3084.1212 3094.8085 3096.2237
redmass: 2.9980 5.1423 2.6952 2.0932 1.1035 1.1372 1.1578 1.0645 2.9880 2.4619 3.1262 2.6939 2.0116 2.1330 2.1605 2.3485 2.6771 2.7270 3.3670 3.3151 2.2695 1.8032 1.8583 2.2721 1.6836 1.3639 1.4058 1.7157 1.2439 1.4172 1.7965 1.6720 1.7930 1.7207 2.5822 2.4549 2.5396 1.4306 2.1194 1.3440 1.2113 1.1790 1.3227 1.2409 1.2299 1.0792 1.0493 1.0519 1.0501 1.0569 1.0457 1.0841 1.0578 1.0653 8.7118 6.4188 1.0835 1.0662 1.0374 1.0387 1.0348 1.0363 1.0969 1.0964 1.0915 1.0991 1.0905 1.1004 1.0977 1.0985 1.0958 1.0992
irintensity: 0.3781 5.5440 0.2291 0.9497 0.0961 0.0680 1.1346 0.4040 3.7440 1.1943 5.8190 0.8651 0.2120 1.0755 2.0205 3.9590 0.7691 3.3120 4.3278 5.5850 7.1429 19.2299 28.8577 14.0596 6.5280 2.0866 0.9236 5.1551 4.7676 0.6259 4.1201 3.8204 14.9329 0.7473 5.9786 8.3268 4.7670 0.9376 2.3186 3.7188 15.0979 2.1425 29.4445 13.9986 11.4043 0.9395 1.0718 1.3120 0.3402 16.5605 28.5526 14.7817 7.1862 19.5197 155.6998 6.5061 120.8157 40.7343 36.9596 47.6373 32.9527 17.6284 7.3897 46.0340 10.0749 30.0470 11.8440 9.7030 16.2184 66.8598 42.4690 22.3072
temp: 298.150 k
press: 1.00000 atm
elementType: 8 6 6 6 6 6 6 6 6 6 1 1 1 1 1 1 1 1 1 1 1 1 1 1 1 1
symmnumber: 1
zpe: 590806.8 jmol-1
zpe.correction: 0.225026 hartree
zpe.thermalcorrener: 0.238225 hartree
zpe.thermalcorrenthalpy: 0.239169 hartree
zpe.thermalcorrgfe: 0.184936 hartree
zpe.sumelectzpe: -426.943237 hartree
zpe.sumelectthermal: -426.930039 hartree
zpe.sumelectthermalent: -426.929094 hartree
zpe.sumelectthermalfe: -426.983327 hartree
dipole: -1.4847 -2.8417 -1.0408
dipole: 3.3709
quadrupole: -62.1368 -67.5799 -62.8553
quadrupole: -6.6668 -3.7971 -2.2552
quadrupole: 2.0539 -3.3893 1.3354 -6.6668 -3.7971 -2.2552
hfenergy: -427.1682637 hartree
pointgroup: C01 [X(C9H16O1)]
dipole: 0.5555589 -1.1559153 0.3377481 debye
dipolederiv: -0.3332499 0.1824765 -0.0120176 0.2627279 -0.8177742 0.0984608 -0.0633479 0.1809587 -0.4673341 0.0579697 0.0556259 0.0167843 0.1011674 -0.3173287 -0.0046591 0.0474739 -0.0315903 0.0219445 0.0903981 -0.0666442 0.0052944 0.007374 0.0411901 -0.0304306 0.0871615 -0.04465 0.1394427 -0.0420931 -0.0212919 0.0079065 -0.0075768 0.0375681 0.0178307 0.0008611 0.0306692 -0.0751131 -0.0251912 0.0467914 0.0331066 -0.0151788 0.0115913 0.0178359 0.0026651 -0.0517082 0.050289 -0.1179321 -0.0001289 -0.0695382 0.1702687 0.0140754 0.0589981 -0.1146465 0.0486621 -0.2401593 0.1551901 -0.3342294 -0.0425666 -0.4571633 1.0359401 -0.083345 -0.0970297 -0.00295 0.7123437 0.2673927 0.0276289 -0.1298037 -0.0429656 0.2531953 0.0780267 -0.1630968 0.0677267 -0.066974 -0.0494516 -0.0908979 0.0264055 -0.0285765 -0.0676506 -0.0168681 0.0610605 -0.0092699 0.0923856 -0.0260112 0.0340585 0.0499212 0.0017622 -0.137044 -0.0550316 0.0417175 -0.0570636 0.0788925 0.0378782 0.0577868 -0.0047648 0.0190958 -0.1302278 -0.0369824 -0.0130582 -0.0720444 0.0646866 -0.0362408 -0.0330459 0.0895006 -0.0620342 0.0781866 0.0031844 0.0589949 0.0340928 -0.1651717 0.0813908 0.0636156 0.0359549 0.0495923 -0.1231265 -0.096576 0.0282044 -0.0460433 0.0425098 -0.0079941 -0.0944316 0.0704384 -0.1130251 0.0095029 0.0399413 0.083903 0.0122097 0.0601327 -0.0919524 0.0439216 -0.1176034 0.0573355 0.0901595 0.0419339 -0.0843128 0.0143212 0.0246102 0.0675709 0.0659703 0.0279775 0.0350119 -0.1276785 -0.044555 0.0277351 -0.0575079 0.0796754 -0.1275566 -0.005336 -0.0748115 0.0333376 0.0725512 0.0364295 -0.115343 0.01528 0.041848 0.0779043 -0.0122234 0.0183619 -0.0140108 0.0942592 -0.0246102 0.0795749 0.0279927 -0.1689726 0.041129 0.0266965 0.0487343 0.0065363 -0.1243527 -0.06046 0.063025 -0.0500124 0.1177821 0.0831759 0.0304766 0.0194084 0.0192418 0.0039398 0.0401863 0.0452747 -0.026284 -0.3138594 0.0290481 -0.0284899 0.0609259 -0.0624398 0.0785374 -0.0073388 0.1269805 0.0434791 -0.137128 0.062082 0.1068575 0.0418305 0.0222168 -0.1103662 -0.0547522 0.0218291 -0.0801354 0.0762029 -0.1465154 0.0020944 -0.0893985 0.0332851 0.062259 0.0603948 -0.1377219 0.0188752 0.0390551 -0.111589 0.0900255 -0.0869453 0.0798987 0.0587718 -0.0092523 -0.121214 0.0420635 0.0350532 -0.00123 -0.1609021 0.006186 -0.1232513 -0.0563093 -0.0018385 0.0136115 0.0189381 0.090017 0.0658774 0.0135951 0.0687124 0.0273703 0.0701307 0.0334772 0.119698 -0.0260097 -0.1321589 unknown
polarizability: 122.2127734|-1.7609956|95.8448966|-8.2460951|-0.3383014|84.3926484 unknown
InChI: InChI=1S/C9H16O/c1-8(2)5-6-9(3,4)7-10/h5,7H,6H2,1-4H3
charge 0 multiplicity 1
26 atoms
O  -2.215085 2.011494 -0.132121
C  -1.464042 -0.35549 0.000203
C  -0.144115 -0.741344 0.767237
C  -1.252683 -0.30688 -1.525269
C  -2.57065 -1.385928 0.382342
C  1.005103 0.221164 0.550734
C  -1.936663 0.995533 0.545455
C  2.245243 -0.044766 0.047251
C  3.280937 1.061343 -0.086268
C  2.719852 -1.410192 -0.418489
H  0.12656 -1.769723 0.464879
H  -0.38523 -0.788855 1.852092
H  -0.98186 -1.308227 -1.908465
H  -0.444348 0.396535 -1.78772
H  -2.170769 0.031002 -2.03681
H  -2.247992 -2.403634 0.095298
H  -3.517678 -1.165473 -0.142237
H  -2.769564 -1.38757 1.471283
H  0.798748 1.262402 0.847026
H  -2.038624 1.011358 1.666693
H  3.608271 1.17272 -1.139325
H  2.889192 2.034975 0.255135
H  4.18988 0.829093 0.503925
H  3.611793 -1.728464 0.15696
H  1.954733 -2.196653 -0.31785
H  3.02889 -1.37042 -1.481959
