program: Gaussian 09
title: 000070435
version: EM64L-G09RevD.01
frameworkgroup: C1[X(C3H10Si)]
method: RPBEPBE
basis: SDD
operation: Freq
keyword: #pfreq=noraman
keyword: PBEPBE/SDD
title: #p freq=noraman PBEPBE/SDD
converged: NO NO NO NO
title: Mulliken charges:
elementType: Si C C C H H H H H H H H H H
charge: 1.014300 -1.017225 -1.017207 -1.017117 -0.100350 0.234300 0.239128 0.239137 0.234316 0.239122 0.239126 0.239103 0.239087 0.234280
chargesum: 0.00000
title: Mulliken charges with hydrogens summed into heavy atoms:
elementType: Si C C C
charge: 0.913950 -0.304660 -0.304643 -0.304648
polarizability: 6.02677024e+01 2.02386315e-05 6.02630228e+01 -2.58835428e-04 2.87794289e-03 5.14237507e+01
1716.lowfreq: -39.6861 -35.2135 -25.6545 -0.0019 -0.0003 0.0007 70.7258 101.6257 112.4697
frequency: 69.9559 100.6680 111.8173 192.6185 195.7863 227.4586 602.9911 640.6065 641.1258 704.6443 705.3888 738.5985 887.8919 888.3643 920.1295 924.8198 925.3340 1301.1948 1302.1932 1315.2250 1445.4262 1449.0085 1449.6512 1457.8559 1458.4134 1464.5637 2079.8980 2985.6519 2985.9337 2986.7463 3084.3253 3084.8045 3086.7597 3088.2429 3089.5980 3089.6649
redmass: 1.0128 1.0375 1.0389 2.3946 2.3841 2.5093 3.8681 1.0444 1.0439 3.6765 3.6785 1.1685 1.2493 1.2523 1.4827 1.4389 1.4402 1.2029 1.2026 1.1900 1.0553 1.0533 1.0533 1.0485 1.0485 1.0459 1.0405 1.0350 1.0350 1.0348 1.0981 1.0981 1.0971 1.0984 1.0975 1.0975
irintensity: 0.0005 0.0012 0.0019 0.6107 0.6265 0.9703 0.8009 12.8189 13.0096 9.0188 8.7352 0.0063 0.0610 0.1618 88.8970 180.8295 181.4714 43.0007 43.1605 9.5640 0.0095 0.6760 0.6764 10.0595 9.9286 21.5338 147.2153 21.5417 20.8506 6.3784 1.5855 2.0638 52.7713 0.0469 29.9915 30.3745
temp: 298.150 k
press: 1.00000 atm
elementType: 14 6 6 6 1 1 1 1 1 1 1 1 1 1
symmnumber: 1
zpe: 309135.1 jmol-1
zpe.correction: 0.117743 hartree
zpe.thermalcorrener: 0.125559 hartree
zpe.thermalcorrenthalpy: 0.126504 hartree
zpe.thermalcorrgfe: 0.086282 hartree
zpe.sumelectzpe: -409.358249 hartree
zpe.sumelectthermal: -409.350433 hartree
zpe.sumelectthermalent: -409.349489 hartree
zpe.sumelectthermalfe: -409.389711 hartree
dipole: 0.0001 0.0005 -0.5646
dipole: 0.5646
quadrupole: -35.2857 -35.2855 -36.4240
quadrupole: -0.0002 -0.0004 0.0002
quadrupole: 0.3794 0.3796 -0.7590 -0.0002 -0.0004 0.0002
hfenergy: -409.4759928 hartree
pointgroup: C01 [X(C3H10Si1)]
dipole: 0.0000818 0.0001677 0.2221362 debye
dipolederiv: 1.2464745 -0.000127 0.0001194 -0.0000736 1.246283 -0.0000299 -0.000037 0.0000227 1.0427733 -0.3975836 0.0663614 0.0330676 0.06631 -0.366704 -0.0263651 0.0340832 -0.0271524 -0.2525235 -0.4320901 -0.0463529 -0.0395261 -0.0462779 -0.3323172 -0.0154771 -0.0406009 -0.0159901 -0.2525412 -0.3170389 -0.0198571 0.0062632 -0.0198036 -0.4469771 0.0417694 0.006546 0.0431078 -0.2523694 -0.2803014 0.0000421 0.0000661 0.0000697 -0.2802884 -0.0000507 -0.0000866 0.0000391 -0.3622197 0.0969282 0.0096432 0.0362394 0.009696 0.1013226 -0.028779 0.03561 -0.0282413 -0.1513566 0.1117934 0.0125996 0.0014345 -0.0029919 -0.1508405 0.0706783 0.0044743 0.0560853 0.0885743 -0.139531 -0.0610112 -0.0685689 -0.0455209 0.1005955 -0.0173683 -0.0537016 -0.0170259 0.0885464 0.09185 -0.0068364 -0.0430512 -0.0068248 0.1063331 -0.0169543 -0.0422176 -0.0165947 -0.15151 -0.0891582 0.1191456 0.0604793 0.103623 0.0502288 -0.0365964 0.0463522 -0.0319824 0.0885925 0.0866309 -0.0851628 0.0192801 -0.0697239 -0.1256527 0.0679857 0.0121868 0.055008 0.0886011 -0.0809721 -0.1083886 -0.061965 -0.1239256 0.0419973 -0.0340991 -0.0508972 -0.0242058 0.0884868 -0.0056194 0.1229102 0.0492814 0.1384136 -0.0333984 -0.0507277 0.0416124 -0.0380214 0.0884782 0.1086175 -0.0029661 0.0068803 -0.0029701 0.0894181 0.0460143 0.0066761 0.0449511 -0.1515321 unknown
polarizability: 60.2657439|-0.0023086|60.2649814|-0.0020504|-0.002036|51.4237507 unknown
InChI: InChI=1S/C3H10Si/c1-4(2)3/h4H,1-3H3
charge 0 multiplicity 1
14 atoms
Si -0.000053 0.000227 -0.450414
C  -1.419393 1.12946 0.147535
C  1.687698 0.664309 0.147451
C  -0.268338 -1.793789 0.147552
H  -0.00008 0.000156 -1.968118
H  -1.466106 1.166346 1.251583
H  -1.290175 2.165266 -0.215109
H  -2.399523 0.770773 -0.215444
H  1.742872 0.685978 1.251469
H  2.51987 0.034276 -0.215383
H  1.867584 1.692552 -0.215186
H  -1.229767 -2.200101 -0.21535
H  0.5326 -2.462976 -0.215411
H  -0.277188 -1.852977 1.251625
