program: Gaussian 09
title: 000070462
version: EM64L-G09RevD.01
frameworkgroup: C1[X(C10H26N4)]
method: RPBEPBE
basis: SDD
operation: Freq
keyword: #pfreq=noraman
keyword: PBEPBE/SDD
title: #p freq=noraman PBEPBE/SDD
converged: YES YES NO NO
title: Mulliken charges:
elementType: N N N N C C C C C C C C C C H H H H H H H H H H H H H H H H H H H H H H H H H H
charge: -0.280681 -0.281747 -0.294131 -0.294757 -0.376001 -0.376433 -0.352347 -0.354609 -0.404456 -0.401225 -0.347427 -0.349578 -0.625649 -0.625879 0.202712 0.193580 0.204746 0.191813 0.172347 0.206065 0.174394 0.203455 0.168254 0.242882 0.204520 0.206329 0.235959 0.238300 0.205179 0.170680 0.171595 0.203892 0.249171 0.250898 0.225364 0.187563 0.221073 0.224770 0.188208 0.221173
chargesum: 0.00000
title: Mulliken charges with hydrogens summed into heavy atoms:
elementType: N N N N C C C C C C C C C C
charge: -0.044722 -0.043447 -0.044960 -0.043859 0.020292 0.020126 0.026065 0.023240 0.006680 0.009624 0.028431 0.025909 0.008349 0.008272
polarizability: 1.96559769e+02 4.50697018e-01 1.21260349e+02 -3.63774459e-02 -1.16828826e+00 1.10412465e+02
1716.lowfreq: -3.4638 -0.0017 0.0004 0.0010 3.1191 15.6364 26.4536 30.6293 39.0057
frequency: 15.9605 26.5165 38.7838 47.2304 71.2045 73.2968 76.7454 100.0940 110.4630 130.8270 136.0721 140.9747 148.8459 163.4235 168.5958 210.2894 233.3717 240.4668 293.6665 319.2886 363.2625 441.2648 441.6151 512.8912 525.5432 652.8985 659.2887 682.7296 694.5860 771.5947 773.2187 814.1345 876.9673 880.8892 951.0943 952.7043 1001.9759 1014.1093 1026.6711 1042.8479 1063.4684 1067.2156 1072.3673 1080.3731 1093.0798 1101.9181 1118.1664 1125.1136 1138.8537 1142.5945 1151.5088 1165.5121 1167.3823 1187.5787 1206.2743 1215.6330 1232.0210 1262.7610 1267.2610 1270.7185 1271.5820 1276.1700 1277.8921 1285.0512 1311.2926 1345.5578 1365.5883 1373.7642 1385.1921 1402.0863 1435.4479 1436.0114 1446.9157 1448.3671 1449.2108 1460.0655 1465.6072 1465.7557 1470.7394 1471.0755 1482.3121 1486.6176 1488.9685 1492.0344 1496.3267 1498.6420 1501.9288 1502.4179 2830.5813 2833.8355 2844.0868 2845.0121 2864.6754 2866.7188 2879.9747 2894.5612 2949.3769 2971.7831 2977.3678 2986.8948 2989.2953 2991.0577 2996.4664 2997.5397 3010.1522 3010.6049 3042.2631 3062.5591 3073.0733 3073.4511 3417.7061 3417.9363 3444.7456 3444.9851
redmass: 4.0637 4.1802 3.3673 1.6818 3.1675 2.5311 2.0753 3.0532 1.7822 2.6015 3.0549 1.7719 2.4812 4.3084 2.3568 2.9108 1.2492 1.2098 3.1825 4.2640 3.0862 3.7909 3.1410 2.9804 3.2131 1.3356 1.3348 1.2585 1.3006 1.0814 1.0813 1.1238 1.2112 1.2157 2.1502 2.1561 3.4056 3.1340 2.8350 2.0466 2.0833 2.2165 1.7899 1.6538 1.7500 1.5135 1.3378 1.7397 1.8883 3.0247 4.2039 3.4386 3.2523 1.7801 1.7594 1.4962 1.4308 1.1933 1.2126 1.1724 1.1907 1.0753 1.1456 1.2519 1.3153 1.3179 1.3427 1.4779 1.5426 1.5274 1.1529 1.1520 1.2147 1.1972 1.2093 1.1854 1.0763 1.0744 1.0726 1.0724 1.0802 1.0766 1.0629 1.0767 1.0718 1.0786 1.0821 1.0823 1.0716 1.0710 1.0713 1.0717 1.0571 1.0569 1.0693 1.0668 1.0690 1.0870 1.0612 1.0860 1.0866 1.0843 1.0901 1.0879 1.0743 1.0744 1.1033 1.0950 1.0993 1.0993 1.0736 1.0739 1.0744 1.0745
irintensity: 0.1400 0.1664 1.0044 1.5500 0.2989 0.7704 1.8676 2.4738 4.2931 2.5136 0.8801 0.5978 1.3784 0.4216 6.2935 1.4234 0.6663 1.8743 5.6356 2.4092 1.8664 3.3598 37.9101 7.1550 1.9688 75.8606 68.3387 53.4662 218.4243 6.1151 3.8156 4.3242 1.6234 0.4571 7.9527 2.2575 4.3344 0.3332 0.0237 12.4658 3.5540 7.3476 1.7022 2.3191 6.3501 10.3287 33.4350 29.2797 0.2926 0.0515 171.1205 0.8099 6.8600 4.9340 3.2167 1.9769 6.4158 0.2915 4.2590 1.7125 1.9052 0.3054 0.1109 1.4529 8.9431 0.0017 6.5294 0.0722 37.5326 0.0046 2.3227 1.9339 0.6823 41.7692 2.5382 51.6455 10.5160 9.2776 2.3541 6.3012 0.2502 34.5996 1.0365 2.7713 0.5148 3.9337 0.6503 9.6855 51.2865 93.6905 204.4095 42.2748 191.1514 172.5317 2.1137 204.6804 20.2820 0.1143 20.7040 28.0728 4.2850 34.1329 4.2146 172.3060 51.2728 53.5383 78.3781 44.7217 41.6686 40.9933 4.1972 0.4522 1.7458 1.4342
temp: 298.150 k
press: 1.00000 atm
elementType: 7 7 7 7 6 6 6 6 6 6 6 6 6 6 1 1 1 1 1 1 1 1 1 1 1 1 1 1 1 1 1 1 1 1 1 1 1 1 1 1
symmnumber: 1
zpe: 953815.7 jmol-1
zpe.correction: 0.363289 hartree
zpe.thermalcorrener: 0.382693 hartree
zpe.thermalcorrenthalpy: 0.383638 hartree
zpe.thermalcorrgfe: 0.312317 hartree
zpe.sumelectzpe: -614.400596 hartree
zpe.sumelectthermal: -614.381192 hartree
zpe.sumelectthermalent: -614.380248 hartree
zpe.sumelectthermalfe: -614.451568 hartree
dipole: -0.0124 0.1082 -1.9542
dipole: 1.9572
quadrupole: -82.6038 -90.8217 -90.3709
quadrupole: 6.9382 3.7826 -3.6845
quadrupole: 5.3283 -2.8896 -2.4388 6.9382 3.7826 -3.6845
hfenergy: -614.7638853 hartree
pointgroup: C01 [X(C10H26N4)]
dipole: -0.0036182 0.0043416 -0.7700192 debye
polarizability: 196.5470782|1.075904|121.1305307|0.0983018|-1.6985152|110.5549746 unknown
InChI: InChI=1S/C10H26N4/c1-11-5-3-7-13-9-10-14-8-4-6-12-2/h11-14H,3-10H2,1-2H3
charge 0 multiplicity 1
40 atoms
N  -1.867997 0.305986 -0.057131
N  1.868877 -0.303428 0.006557
N  -6.840209 0.467565 -0.005311
N  6.837522 -0.470124 -0.010315
C  -0.608723 -0.468915 -0.062104
C  0.609127 0.471238 0.008291
C  -3.100296 -0.511658 -0.036965
C  3.100221 0.516349 -0.004313
C  -4.354494 0.383206 -0.020858
C  4.353928 -0.378845 -0.006033
C  -5.664906 -0.42718 -0.014559
C  5.665549 0.429104 -0.00159
C  -8.140639 -0.225428 0.024602
C  8.140945 0.217641 0.017561
H  -0.493328 -1.13534 -0.951456
H  -0.615128 -1.127376 0.831582
H  0.492113 1.137708 0.897157
H  0.616959 1.129484 -0.885666
H  -3.161758 -1.22365 -0.901075
H  -3.080836 -1.132967 0.881223
H  3.15522 1.226854 0.861142
H  3.086288 1.139051 -0.921849
H  -4.340733 1.045753 -0.91473
H  -4.325759 1.041064 0.865895
H  4.313132 -1.036394 -0.897655
H  4.350893 -1.041812 0.882272
H  -1.889649 0.986091 -0.83141
H  1.888134 -0.982181 0.782142
H  -5.706911 -1.05205 0.900745
H  -5.668463 -1.137523 -0.883427
H  5.662453 1.146005 -0.864905
H  5.718474 1.046818 0.918083
H  -6.788081 1.161297 -0.763416
H  6.776812 -1.153766 -0.776885
H  -8.233249 -0.79372 0.969209
H  -8.30124 -0.947347 -0.815104
H  -8.959194 0.515856 0.002066
H  8.24292 0.775194 0.967621
H  8.297915 0.947992 -0.815339
H  8.95641 -0.526454 -0.019652
