program: Gaussian 09
title: 000070445
version: EM64L-G09RevD.01
frameworkgroup: C1[X(C9H21ClSi)]
method: RPBEPBE
basis: SDD
operation: Freq
keyword: #p
keyword: freq=noraman
keyword: PBEPBE/SDD
title: #p freq=noraman PBEPBE/SDD
converged: YES YES NO NO
title: Mulliken charges:
elementType: Cl Si C C C C C C C C C H H H H H H H H H H H H H H H H H H H H H
charge: -0.333828 1.070749 -0.762282 -0.762084 -0.771763 -0.320997 -0.320912 -0.345247 -0.682714 -0.682721 -0.675775 0.220692 0.241185 0.241069 0.220669 0.243045 0.242887 0.198458 0.227267 0.227293 0.198430 0.205633 0.205547 0.219442 0.212335 0.204822 0.219446 0.204827 0.212314 0.218119 0.212037 0.212056
chargesum: 0.00000
title: Mulliken charges with hydrogens summed into heavy atoms:
elementType: Cl Si C C C C C C C C C
charge: -0.333828 1.070749 -0.300405 -0.300346 -0.285831 0.104728 0.104811 0.065932 -0.046115 -0.046134 -0.033562
polarizability: 1.44799076e+02 4.89759112e-03 1.32137291e+02 -1.47734679e-02 -3.79349945e+00 1.16560076e+02
1716.lowfreq: -21.7528 -6.7536 -1.5035 0.0029 0.0030 0.0036 16.5664 40.6426 57.3871
frequency: -14.2173 40.6411 57.3283 61.6110 72.0715 73.5697 83.7079 96.1718 135.5995 179.0142 180.5870 232.1194 232.6899 237.8246 244.2952 255.4146 259.1484 279.4541 349.9953 408.0606 436.5959 655.0553 671.7258 702.9367 714.6050 722.5604 780.3723 795.7262 822.9391 826.6908 894.4822 900.8943 901.2730 995.0580 1015.3675 1020.0901 1045.4609 1046.2584 1050.3256 1071.7364 1073.8800 1089.7885 1208.7013 1213.0554 1214.6235 1216.5638 1219.5584 1228.9915 1289.7059 1293.3327 1296.8785 1327.4804 1333.7208 1336.8904 1387.6129 1389.2232 1389.3076 1424.3354 1430.9632 1434.3401 1470.5522 1473.7385 1474.5921 1474.9364 1476.2439 1476.4275 1482.6681 1483.4210 1484.5699 2959.7961 2959.8492 2963.0388 2971.8587 2972.1538 2973.3754 2974.9027 2975.8033 2987.8229 3004.6587 3015.1702 3016.5703 3037.0372 3038.8481 3047.5691 3070.9182 3071.0712 3072.6406 3072.7634 3073.1561 3073.8840
redmass: 2.8254 3.1175 1.6279 3.9946 1.7070 1.7253 3.6800 3.8491 3.1294 2.4480 3.1083 1.0946 1.1007 1.1035 3.8946 2.6365 3.5041 3.3868 3.1206 3.8572 7.1118 3.2508 1.3170 1.4253 1.2261 1.8734 3.8319 1.2087 1.3467 1.2928 2.1047 2.0659 2.1328 1.1127 1.1949 1.2168 2.2969 2.5492 2.6325 1.9996 2.2045 2.1602 1.4411 1.4284 1.3823 1.3918 1.3785 1.3404 1.0922 1.0885 1.0874 1.4062 1.4071 1.4060 1.2069 1.2119 1.2118 1.0779 1.0805 1.0769 1.0605 1.0482 1.0428 1.0455 1.0439 1.0441 1.0693 1.0799 1.0835 1.0595 1.0597 1.0595 1.0359 1.0359 1.0355 1.0619 1.0620 1.0588 1.1011 1.0954 1.0955 1.1011 1.1007 1.1010 1.0998 1.0997 1.1006 1.0999 1.1006 1.1007
irintensity: 0.0014 0.0130 0.1762 0.3130 0.3650 0.0870 2.2025 2.1340 1.4946 0.1409 2.3181 0.0060 0.0365 0.0256 0.9546 1.3059 0.3607 0.8779 11.1973 16.3745 50.4487 4.6138 2.2180 0.1058 56.6147 44.6574 43.7565 1.3066 10.0483 4.6498 1.5580 1.6376 5.7787 2.7497 5.3467 18.3072 16.8950 5.7664 2.0649 47.4308 87.0016 6.4960 7.7123 0.6527 3.8501 0.7711 16.7338 7.2282 0.0053 1.2597 0.1871 1.7833 2.6686 0.4931 10.9925 10.4797 9.0684 0.9472 16.1108 17.8443 2.9151 1.3298 15.4875 9.0347 0.2863 18.1933 27.4536 2.1821 4.4986 9.4784 2.3313 27.3042 55.0972 49.8208 30.0967 5.4609 47.3321 24.6174 10.9587 0.5067 3.1489 0.9294 26.6295 15.6622 40.9268 63.4787 0.9036 32.2431 129.2050 69.1438
temp: 298.150 k
press: 1.00000 atm
elementType: 17 14 6 6 6 6 6 6 6 6 6 1 1 1 1 1 1 1 1 1 1 1 1 1 1 1 1 1 1 1 1 1
symmnumber: 1
zpe: 735574.5 jmol-1
zpe.correction: 0.280166 hartree
zpe.thermalcorrener: 0.296359 hartree
zpe.thermalcorrenthalpy: 0.297304 hartree
zpe.thermalcorrgfe: 0.235369 hartree
zpe.sumelectzpe: -1104.132191 hartree
zpe.sumelectthermal: -1104.115997 hartree
zpe.sumelectthermalent: -1104.115053 hartree
zpe.sumelectthermalfe: -1104.176988 hartree
dipole: 0.0080 2.3621 -2.4818
dipole: 3.4262
quadrupole: -83.5717 -88.3887 -89.8751
quadrupole: -0.0151 0.0172 4.5109
quadrupole: 3.7068 -1.1102 -2.5966 -0.0151 0.0172 4.5109
hfenergy: -1104.4123568 hartree
pointgroup: C01 [X(C9H21Cl1Si1)]
dipole: -0.0022378 -0.8046607 -1.0814606 debye
polarizability: 144.7987796|0.0617114|131.0013461|-0.0528501|5.549485|117.6963163 unknown
InChI: InChI=1S/C9H21ClSi/c1-4-7-11(10,8-5-2)9-6-3/h4-9H2,1-3H3
charge 0 multiplicity 1
32 atoms
Cl 0.006641 1.723015 2.081766
Si 0.003169 0.481326 0.215362
C  -1.590296 0.960022 -0.726474
C  1.591419 0.962816 -0.733841
C  0.005563 -1.335178 0.809967
C  -2.910243 0.624177 0.014939
C  2.915363 0.633023 0.003163
C  -0.000543 -2.366454 -0.352541
C  -4.159865 1.064007 -0.779626
C  4.160405 1.075894 -0.796867
C  0.002318 -3.824385 0.160103
H  -1.572773 0.450446 -1.714021
H  -1.549235 2.047152 -0.940483
H  1.545954 2.049306 -0.950258
H  1.571705 0.450852 -1.720107
H  -0.876086 -1.4960 1.461434
H  0.893388 -1.496877 1.452761
H  -2.964568 -0.466573 0.207652
H  -2.90743 1.117781 1.006199
H  2.9145 1.128344 0.993556
H  2.974219 -0.457186 0.197556
H  -0.892084 -2.208175 -0.993373
H  0.884062 -2.208089 -1.002957
H  -5.090248 0.815708 -0.236092
H  -4.150448 2.156258 -0.954171
H  -4.199079 0.566059 -1.76704
H  5.093678 0.832229 -0.256199
H  4.197957 0.576083 -1.783401
H  4.146237 2.16775 -0.973591
H  -0.00217 -4.547509 -0.676419
H  0.898351 -4.02181 0.777722
H  -0.886964 -4.021913 0.78738
