program: Gaussian 09
title: 000070444
version: EM64L-G09RevD.01
frameworkgroup: C1[X(C9H22NO3P)]
method: RPBEPBE
basis: SDD
operation: Freq
keyword: #p
keyword: freq=noraman
keyword: PBEPBE/SDD
title: #p freq=noraman PBEPBE/SDD
converged: YES YES NO NO
title: Mulliken charges:
elementType: P O O O N C C C C C C C C C H H H H H H H H H H H H H H H H H H H H H H
charge: 1.227070 -0.508950 -0.549666 -0.645560 -0.035634 -0.664105 -0.333908 -0.337489 -0.678367 -0.670364 -0.228054 -0.213840 -0.656165 -0.653175 0.285958 0.250251 0.202676 0.211100 0.209011 0.205518 0.204932 0.291821 0.204402 0.253643 0.240175 0.206538 0.190809 0.225729 0.238433 0.204191 0.201740 0.232441 0.230582 0.206766 0.224482 0.227008
chargesum: 0.00000
title: Mulliken charges with hydrogens summed into heavy atoms:
elementType: P O O O N C C C C C C C C C
charge: 1.227070 -0.508950 -0.549666 -0.645560 -0.035634 -0.127896 0.079868 0.077040 0.022788 0.029992 0.188485 0.228784 0.008600 0.005080
polarizability: 1.78037237e+02 -2.11088366e+00 1.49636790e+02 -1.18346937e+00 -3.02450385e+00 1.18833181e+02
1716.lowfreq: -0.0004 0.0013 0.0022 0.3991 6.3528 12.5618 18.8313 20.9693 37.2697
frequency: 18.1199 20.6888 36.9835 43.1710 52.5991 77.9883 79.1752 101.6005 104.0955 131.2378 139.9190 159.3718 166.2834 211.9333 235.5798 242.3161 244.8519 267.1709 270.2459 302.4390 330.9268 339.9021 382.0203 392.7707 433.0319 460.3319 489.1661 528.0991 620.5410 641.1740 737.6524 776.1916 801.1469 807.9952 808.5164 855.7089 867.3640 874.4077 931.9697 993.4248 1014.3753 1019.0374 1029.1489 1066.6713 1086.5173 1099.4424 1101.2858 1103.1087 1111.8045 1130.1171 1137.9611 1157.8529 1238.8944 1249.7231 1263.1393 1264.8207 1273.0353 1336.2907 1349.5443 1351.1731 1359.0421 1363.6733 1386.4345 1389.3576 1392.7999 1394.9974 1400.9898 1412.0299 1456.5625 1458.6452 1458.9756 1466.5277 1473.5162 1476.8740 1477.0846 1477.9874 1488.1513 1491.1249 1496.9285 1501.3452 2950.9875 2953.7141 2961.5388 2974.8677 2980.2845 2982.4655 2989.2428 2991.1321 2999.3367 3022.9618 3026.5295 3033.3071 3042.8961 3070.9610 3073.7132 3084.7376 3086.4201 3087.8478 3089.9935 3101.0150 3103.6017 3106.2285
redmass: 2.7615 2.9089 2.4060 2.8916 2.4291 3.1195 2.4749 2.4790 3.4022 3.6115 3.5572 4.0427 5.2257 2.8352 1.4466 1.2537 1.2873 1.0957 2.2728 4.3993 2.3565 3.8247 3.9897 3.1981 1.8638 2.6156 6.1168 6.5599 6.5565 6.5365 2.3286 1.1539 1.2293 1.1013 1.0966 1.8840 3.6547 3.1908 1.9485 2.9730 4.8279 2.7823 3.9758 2.2445 1.8350 2.1719 2.0490 1.7485 1.8399 1.4337 1.4805 1.5600 1.6398 1.1705 1.1429 1.1710 1.1222 1.3709 1.2766 1.2574 1.2549 1.3917 1.5746 1.2494 1.2393 1.2204 1.2003 1.2389 1.0405 1.0440 1.0697 1.0993 1.0439 1.0510 1.0487 1.0480 1.0796 1.0816 1.0565 1.0544 1.0605 1.0641 1.0624 1.0363 1.0547 1.0374 1.0380 1.0366 1.0580 1.1023 1.0996 1.0977 1.1078 1.0988 1.0991 1.0979 1.1070 1.0981 1.1031 1.0994 1.1020 1.1015
irintensity: 0.0576 0.7339 0.7750 1.3196 1.7524 1.2810 2.1988 0.0673 3.1333 2.3539 7.8367 3.7127 31.9889 6.9188 1.3034 1.1807 3.4645 0.2975 5.5699 11.6858 0.5175 22.4967 13.7275 26.7932 4.5243 3.6374 44.4634 47.7369 101.9818 117.4038 1.8002 1.0029 18.0208 5.7413 3.2151 15.7951 183.4316 139.4191 31.2869 3.6240 236.2973 131.7629 37.7273 0.4635 16.3361 28.4929 17.5173 15.5737 54.4287 4.8361 4.6682 8.1594 107.8979 1.7217 7.5497 7.3557 8.2985 28.2214 7.4413 17.9221 10.4585 6.8233 92.2444 17.7055 30.3470 16.8661 23.4794 9.7782 10.2555 9.6295 6.2889 15.4374 5.9411 4.6916 12.6152 5.9043 16.4167 0.4785 6.6577 10.0211 17.2701 86.4585 89.9620 59.0405 38.7611 28.9600 33.8161 30.6523 21.2585 25.9211 11.1663 33.1203 11.7927 57.7441 32.1190 35.3273 3.8040 33.5857 13.7086 21.8273 38.6136 35.2553
temp: 298.150 k
press: 1.00000 atm
elementType: 15 8 8 8 7 6 6 6 6 6 6 6 6 6 1 1 1 1 1 1 1 1 1 1 1 1 1 1 1 1 1 1 1 1 1 1
symmnumber: 1
zpe: 806874.5 jmol-1
zpe.correction: 0.307322 hartree
zpe.thermalcorrener: 0.327350 hartree
zpe.thermalcorrenthalpy: 0.328294 hartree
zpe.thermalcorrgfe: 0.255995 hartree
zpe.sumelectzpe: -976.590467 hartree
zpe.sumelectthermal: -976.570439 hartree
zpe.sumelectthermalent: -976.569495 hartree
zpe.sumelectthermalfe: -976.641794 hartree
dipole: 0.0849 0.9061 -3.7210
dipole: 3.8307
quadrupole: -81.7771 -89.6174 -103.5266
quadrupole: 0.3875 -1.1212 -1.2960
quadrupole: 9.8633 2.0229 -11.8862 0.3875 -1.1212 -1.2960
hfenergy: -976.8977889 hartree
pointgroup: C01 [X(C9H22N1O3P1)]
dipole: -0.0023455 0.1239863 -1.5019847 debye
polarizability: 175.2370215|-9.5332703|147.610729|3.196887|11.1568492|123.6594571 unknown
InChI: InChI=1S/C5H12N.C4H10O3P/c1-4-6(3)5-2;1-3-6-8(5)7-4-2/h3-5H2,1-2H3;3-4H2,1-2H3
charge 0 multiplicity 1
36 atoms
P  0.391418 -0.018638 0.134723
O  0.525335 -1.771367 -0.113916
O  1.950438 0.604051 -0.403123
O  0.070536 0.25444 1.674891
N  -2.123377 1.01383 -1.018916
C  -0.753071 0.804606 -1.296299
C  -2.546624 2.191513 -0.226906
C  -3.079047 -0.095218 -1.219382
C  -2.803329 1.947114 1.280365
C  -2.977787 -1.276364 -0.220738
C  1.163535 -2.289472 -1.350525
C  3.090185 0.607268 0.55758
C  1.44668 -3.771109 -1.105384
C  3.970795 1.807968 0.215779
H  -0.209431 1.750158 -1.462696
H  -0.602059 0.12992 -2.15837
H  -1.759962 2.96195 -0.342042
H  -3.465417 2.60073 -0.695455
H  -4.094499 0.341494 -1.174454
H  -2.944868 -0.484909 -2.25076
H  -3.664117 1.271373 1.435188
H  -1.916218 1.504454 1.766519
H  -3.041796 2.908138 1.774679
H  -1.988049 -1.766306 -0.261323
H  -3.142664 -0.944279 0.817858
H  -3.742497 -2.036992 -0.468168
H  0.47337 -2.157766 -2.210828
H  2.093346 -1.724486 -1.557519
H  2.693906 0.669034 1.589519
H  3.642127 -0.3456 0.442144
H  1.910612 -4.226934 -2.000401
H  2.131285 -3.895147 -0.249327
H  0.511521 -4.311558 -0.879888
H  4.858779 1.828262 0.875461
H  4.316199 1.753551 -0.831232
H  3.412147 2.749792 0.351046
