program: Gaussian 09
title: 000070594
version: EM64L-G09RevD.01
frameworkgroup: C1[X(C26H18N4)]
method: RPBEPBE
basis: SDD
operation: Freq
keyword: #pfreq=noraman
keyword: PBEPBE/SDD
title: #p freq=noraman PBEPBE/SDD
converged: YES YES NO NO
title: Mulliken charges:
elementType: N N N N C C C C C C C C C C C C C C C C C C C C C C C C C C H H H H H H H H H H H H H H H H H H
charge: -0.074977 -0.107577 -0.023517 0.030201 0.069625 -0.010457 0.320993 0.374653 0.325401 0.015325 -0.123796 0.344236 -0.425426 -0.317850 -0.378960 -0.369194 -0.375574 -0.375466 -0.391249 -0.392095 -0.381236 -0.234132 -0.228238 -0.232663 -0.227398 -0.238789 -0.236271 -0.234859 -0.240303 -0.236080 0.275183 0.237932 0.262396 0.259720 0.278956 0.254745 0.241870 0.239495 0.244355 0.229653 0.232920 0.231344 0.230732 0.233062 0.228770 0.229783 0.231850 0.232905
chargesum: 0.00000
title: Mulliken charges with hydrogens summed into heavy atoms:
elementType: N N N N C C C C C C C C C C C C C C C C C C C C C C C C C C
charge: -0.074977 -0.107577 -0.023517 0.030201 0.069625 -0.010457 0.320993 0.374653 0.325401 0.015325 -0.123796 0.344236 -0.150243 -0.079918 -0.116564 -0.109474 -0.096618 -0.120721 -0.149379 -0.152599 -0.136881 -0.004479 0.004682 -0.001319 0.003334 -0.005727 -0.007501 -0.005076 -0.008453 -0.003175
polarizability: 5.29833987e+02 9.97507986e+00 3.66845987e+02 -3.52650697e+00 2.41196233e+01 1.59158279e+02
1716.lowfreq: -7.3439 -4.9236 -0.0007 0.0004 0.0006 3.4299 11.2037 24.1496 33.8137
frequency: 10.7590 24.0836 33.8073 42.5603 47.0291 55.2044 66.9225 86.3218 102.0982 107.5530 127.8366 164.1585 185.4465 201.9715 240.3760 243.2492 262.0304 291.3961 300.3995 343.8054 356.7961 401.6417 405.1022 406.3331 419.2582 421.6706 426.1925 458.8241 492.8248 503.5763 533.2995 581.1580 598.5488 610.0012 612.5734 615.2044 616.9626 629.9138 641.3647 685.5431 695.1961 698.9552 700.9129 701.4722 709.4697 749.9245 765.0793 772.0168 773.9264 778.2615 796.9360 850.0018 852.5847 854.6304 857.0206 862.0549 921.9944 931.4394 933.4137 934.9161 960.1232 963.7869 969.0397 976.7913 982.6443 984.0129 988.3212 988.6758 990.0139 997.7553 1000.5374 1000.6063 1006.2059 1019.0746 1028.0124 1038.8662 1049.1032 1073.1976 1081.6310 1085.7584 1086.7284 1102.4069 1120.6130 1157.6771 1174.0411 1174.4210 1175.2848 1189.7688 1191.9535 1195.7204 1246.4950 1273.8233 1289.8587 1294.4406 1308.5052 1319.3733 1321.7791 1325.4360 1357.2204 1378.3004 1379.1219 1383.4647 1403.1488 1414.3003 1432.0704 1436.3681 1442.2304 1451.0513 1461.8923 1486.1765 1490.3193 1492.4790 1538.4257 1581.9436 1582.8147 1584.0377 1588.3477 1608.0891 1610.9111 1614.0005 3125.4690 3128.6301 3129.1367 3129.3856 3130.7705 3138.7211 3139.3546 3141.7824 3151.0817 3151.4293 3152.1267 3158.4523 3161.3261 3162.6122 3166.6788 3168.9592 3170.9624 3172.6300
redmass: 5.7636 5.4803 4.6578 3.8197 4.9722 4.8417 4.4092 4.9722 5.4281 6.1438 6.0006 5.0818 5.3740 5.8222 6.2000 5.6566 5.3421 5.3595 6.8471 6.3240 5.4576 2.8403 2.8358 2.8432 5.3035 4.6133 5.3863 4.8849 4.0103 4.3920 4.6564 5.1184 7.1023 7.5413 6.3325 6.5042 6.5639 7.1802 7.0746 5.5430 3.5280 1.8563 1.7719 2.2354 5.4258 3.0728 2.2248 2.0609 4.2133 2.4668 4.3818 1.3006 1.3146 1.8141 1.3863 2.3822 1.4037 1.4266 1.4128 1.5808 5.1331 7.7496 1.4928 1.4827 1.4086 1.4606 5.0978 6.1765 5.1035 1.3215 1.3378 1.3300 6.2603 3.4175 2.1241 2.2125 2.2336 3.0021 1.7172 1.6182 1.8937 1.8504 3.6246 3.7483 1.0556 1.0555 1.0549 1.1149 1.1271 1.1246 2.3756 3.6930 2.6905 2.3371 2.5109 1.4987 1.4288 1.7261 3.3614 6.8643 5.8854 6.9399 4.4483 3.8538 2.6134 2.2783 2.4950 3.2607 4.6894 2.5448 2.5514 2.8822 6.8443 5.9721 5.9984 5.6666 6.1994 5.9733 6.0312 6.0307 1.0847 1.0850 1.0877 1.0851 1.0881 1.0886 1.0884 1.0921 1.0966 1.0935 1.0929 1.0961 1.0959 1.0967 1.1005 1.0934 1.1010 1.0996
irintensity: 0.1865 0.9193 0.4153 0.0703 0.2650 0.4396 0.1269 0.1169 0.4110 0.4519 0.4558 1.3557 0.1738 0.6344 0.6724 0.7532 3.5484 0.3835 0.0606 1.6678 1.2283 0.0111 0.3362 0.8734 1.4775 1.0123 6.0917 1.6038 9.1031 1.3567 29.5420 20.0103 6.8393 18.7415 0.7603 0.3928 3.7524 1.4400 9.0343 7.0734 28.1754 49.0116 65.9195 13.1570 10.9863 1.8374 25.1857 93.8278 51.8182 10.1179 14.0781 2.1253 5.6200 2.5739 5.7371 18.2949 4.1271 3.8435 3.2000 4.1987 0.4731 3.1614 1.3906 1.0296 2.3127 2.1844 0.6817 1.3658 0.8232 0.0348 0.1677 0.5863 6.8066 16.2046 4.7641 11.1443 22.5183 64.9600 14.2214 3.3309 43.1301 4.2967 10.3243 1.9425 0.0644 0.3840 0.0161 5.6153 9.2620 3.6701 20.5088 23.5506 24.1190 10.0264 6.3158 17.7056 2.5645 0.2218 16.2176 5.9317 14.8832 6.7644 78.6379 67.6557 38.3826 10.7493 6.3183 41.2926 22.5997 1.0233 12.8188 3.3791 42.4618 2.4947 0.6714 79.4869 12.6141 4.6952 0.7080 0.2699 5.9822 0.8944 6.3913 0.3240 13.3281 7.6991 4.1822 16.7088 26.2515 35.3460 13.5537 34.1895 18.4239 17.6369 19.6290 8.3931 19.2010 20.5335
temp: 298.150 k
press: 1.00000 atm
elementType: 7 7 7 7 6 6 6 6 6 6 6 6 6 6 6 6 6 6 6 6 6 6 6 6 6 6 6 6 6 6 1 1 1 1 1 1 1 1 1 1 1 1 1 1 1 1 1 1
symmnumber: 1
zpe: 963129.7 jmol-1
zpe.correction: 0.366837 hartree
zpe.thermalcorrener: 0.390114 hartree
zpe.thermalcorrenthalpy: 0.391058 hartree
zpe.thermalcorrgfe: 0.310796 hartree
zpe.sumelectzpe: -1218.528688 hartree
zpe.sumelectthermal: -1218.505411 hartree
zpe.sumelectthermalent: -1218.504467 hartree
zpe.sumelectthermalfe: -1218.584729 hartree
dipole: 0.7880 5.1211 1.2941
dipole: 5.3405
quadrupole: -125.4273 -168.7387 -175.7029
quadrupole: -6.1480 -0.3785 0.8922
quadrupole: 31.1957 -12.1157 -19.0799 -6.1480 -0.3785 0.8922
hfenergy: -1218.895525 hartree
pointgroup: C01 [X(C26H18N4)]
dipole: -0.2524688 -1.8775474 0.9087174 debye
polarizability: 529.2845483|12.9691304|349.4942006|-4.3753494|-63.268072|177.0595037 unknown
InChI: InChI=1S/C26H18N4/c1-4-10-19(11-5-1)22-16-17-27-23(18-22)26-28-24(20-12-6-2-7-13-20)25(29-30-26)21-14-8-3-9-15-21/h1-18H
charge 0 multiplicity 1
48 atoms
N  0.305348 0.045862 -0.238073
N  2.015341 1.9234 -1.282789
N  0.680223 2.104133 -1.443174
N  -1.895302 2.924364 -0.637112
C  1.639795 -0.2434 -0.27728
C  2.534671 0.844561 -0.591282
C  2.026709 -1.661707 -0.079109
C  -3.889191 0.913307 -0.13026
C  3.970562 0.940608 -0.242415
C  -1.567009 1.596056 -0.539989
C  -0.13548 1.239401 -0.714659
C  -4.921649 -0.127332 0.135501
C  -2.520235 0.577467 -0.289693
C  -4.227394 2.29021 -0.240496
C  1.199958 -2.505604 0.712491
C  3.174919 -2.216227 -0.709509
C  4.840459 1.728125 -1.046969
C  4.488928 0.312882 0.924253
C  -4.602869 -1.294572 0.882354
C  -6.249453 0.02188 -0.350967
C  -3.212083 3.239467 -0.489747
C  1.522933 -3.866985 0.88477
C  3.488977 -3.580524 -0.543603
C  6.199994 1.867567 -0.701575
C  5.848193 0.460054 1.268622
C  2.669445 -4.410418 0.258072
C  -5.580131 -2.279732 1.136213
C  -7.226789 -0.964097 -0.100005
C  6.711162 1.232342 0.455202
C  -6.897134 -2.119595 0.645925
H  -2.177504 -0.460116 -0.255853
H  -5.259659 2.627418 -0.102756
H  0.310916 -2.074754 1.183392
H  3.810277 -1.58661 -1.340256
H  4.428442 2.225389 -1.930091
H  3.827321 -0.276964 1.566978
H  -3.593149 -1.417104 1.290179
H  -6.510501 0.897454 -0.956153
H  -3.454668 4.305677 -0.563322
H  0.883404 -4.504385 1.505237
H  4.369847 -3.997907 -1.043301
H  6.860951 2.471922 -1.332509
H  6.233088 -0.022452 2.173695
H  2.920079 -5.468847 0.389698
H  -5.317611 -3.167526 1.722103
H  -8.241437 -0.835956 -0.492883
H  7.768008 1.341595 0.722892
H  -7.655901 -2.885128 0.84185
