program: Gaussian 09
title: 000070415
version: EM64L-G09RevD.01
frameworkgroup: C1[X(C20H23N3)]
method: RPBEPBE
basis: SDD
operation: Freq
keyword: #pfreq=noraman
keyword: PBEPBE/SDD
title: #p freq=noraman PBEPBE/SDD
converged: NO YES NO NO
title: Mulliken charges:
elementType: N N N C C C C C C C C C C C C C C C C C C C C H H H H H H H H H H H H H H H H H H H H H H H
charge: -0.080615 -0.493237 -0.003988 0.360436 -0.460848 -0.533101 -0.395285 -0.398754 -0.480346 -0.250618 0.292421 0.449628 0.283956 -0.326338 -0.447512 -0.379001 -0.386129 -0.848417 -0.268319 -0.220784 -0.228591 -0.261861 -0.244840 0.228066 0.237315 0.218912 0.229918 0.215200 0.240194 0.219319 0.213588 0.324502 0.200694 0.220826 0.235304 0.233497 0.260639 0.225037 0.219173 0.231555 0.240717 0.223560 0.225863 0.225052 0.224948 0.228265
chargesum: 0.00000
title: Mulliken charges with hydrogens summed into heavy atoms:
elementType: N N N C C C C C C C C C C C C C C C C C C C C
charge: -0.080615 -0.168735 -0.003988 0.360436 0.004533 -0.084271 0.060110 0.034153 -0.058826 -0.250618 0.292421 0.449628 0.283956 -0.091035 -0.214015 -0.118362 -0.161092 -0.156973 -0.044760 0.005078 -0.003538 -0.036913 -0.016576
polarizability: 2.78407332e+02 -9.84239250e+00 1.98244875e+02 1.41879777e+01 -4.22911825e+00 2.07826556e+02
1716.lowfreq: -11.5953 -0.0007 -0.0006 -0.0003 1.1062 5.9352 22.7826 29.2629 34.3315
frequency: 22.6050 29.1894 34.3023 55.7162 59.2239 73.5533 97.7017 139.6469 155.6729 159.8487 188.2158 198.9636 203.0201 230.3069 247.1451 260.0665 285.8405 302.0061 316.8241 320.6734 349.4678 393.1119 403.7319 406.7213 437.0374 450.9317 456.9334 483.5964 514.0960 544.7635 560.6109 568.4144 601.7108 607.7786 618.0036 644.2830 705.3943 709.8789 720.5863 738.0546 751.1405 766.6223 775.7409 808.0988 811.7656 838.0369 846.3469 859.8438 904.8944 915.1944 926.5952 942.2977 970.5219 978.8782 980.7852 983.0288 990.1639 996.1283 1006.4891 1021.4460 1026.9787 1040.8288 1041.3717 1054.6533 1077.9179 1091.4477 1110.4613 1114.2214 1130.1713 1150.6712 1165.8964 1170.7832 1177.1255 1178.3448 1182.0343 1199.4080 1213.8691 1226.4020 1263.9655 1273.3068 1286.0142 1294.0904 1308.3358 1313.8549 1319.3806 1337.8117 1341.4570 1363.2372 1374.1906 1381.8904 1394.7036 1398.8074 1441.3275 1441.7905 1445.9927 1457.7741 1460.2692 1461.3430 1469.5685 1473.7633 1478.9084 1483.9041 1491.0134 1512.7917 1593.7228 1594.8635 1615.1600 1620.4781 2167.9186 2851.9451 2854.0978 2866.0491 2945.2254 2986.0552 2993.1130 3013.9943 3021.0620 3029.4817 3049.4016 3061.2748 3084.7060 3094.8452 3114.0936 3117.9934 3123.5501 3132.1278 3136.4589 3147.4912 3156.6205 3162.1737 3170.5708 3555.7617
redmass: 4.7713 4.4714 3.7556 5.0271 4.7781 4.0259 6.5489 4.1853 4.2222 3.0688 4.5160 1.1196 3.8996 3.5439 3.1315 2.3232 3.4256 1.2316 2.3515 3.9865 2.3343 3.0685 2.5534 2.8565 3.1357 3.6002 3.0128 3.5937 4.9761 3.5909 4.4874 4.4025 4.4321 4.7893 6.0759 3.5300 2.2008 4.1407 2.5814 1.6650 1.4589 4.3558 2.7929 2.4875 2.0415 4.1836 1.3457 1.2482 2.2357 1.5277 1.3671 1.9535 1.3123 1.7136 1.8784 1.4278 5.7990 1.4486 1.7330 1.7917 2.0926 1.9441 1.9199 2.1031 1.6110 3.0140 2.4410 2.5879 2.3643 2.9137 1.8888 1.0572 1.1762 1.1655 1.1142 1.8572 2.5286 1.4393 1.3862 1.5128 1.9331 1.3902 1.4680 1.4868 1.5433 1.4092 1.4097 1.4485 4.0965 3.5730 1.3111 1.7447 2.0953 2.1795 1.1055 1.5231 1.1192 1.1024 1.1026 1.0671 1.1955 1.8803 1.4001 1.8514 4.9790 6.1495 6.1410 6.2801 12.6572 1.0708 1.0720 1.0697 1.0413 1.0869 1.0592 1.0953 1.0628 1.0873 1.0874 1.1037 1.0950 1.1005 1.0869 1.0875 1.0862 1.0885 1.0914 1.0956 1.0943 1.1014 1.0979 1.0762
irintensity: 0.2680 0.1673 0.2080 0.7130 0.9384 1.2191 2.3693 3.2696 0.5805 1.9531 0.4910 4.9066 2.9935 2.8628 4.1046 0.0604 1.0705 89.3184 0.7177 3.8850 3.8043 0.6056 1.5336 0.0770 2.7355 0.5929 14.5042 3.2694 1.2887 0.3899 0.5474 2.2567 3.3545 0.2036 0.0614 0.8900 32.9126 13.6811 6.4485 53.3773 85.7340 4.5080 25.8098 3.5206 2.8574 1.7686 0.5866 0.2522 2.1254 5.1640 1.0310 1.0245 0.1103 24.7707 9.7805 1.0896 0.3796 2.2857 7.5341 4.7702 10.7449 6.8129 10.1038 15.0608 18.2366 29.8173 4.1498 47.8154 25.1135 19.0337 14.6452 0.3721 6.7706 2.9105 1.2487 1.0156 4.5936 2.6405 6.8892 10.5175 65.2331 9.1053 17.1028 35.9606 28.1243 60.5215 15.5019 2.1228 32.4890 1.6155 14.5508 2.5683 8.1963 33.1926 9.8852 6.2508 7.7791 3.0521 7.7364 17.4147 12.2347 14.6006 76.6249 138.4926 30.5409 1.0510 7.3246 80.6959 1.9350 31.4967 32.1756 149.8962 40.6653 21.7866 21.7585 24.9771 11.3500 43.7784 18.4587 24.7339 20.0547 14.6425 7.9728 15.3487 0.1116 11.1819 17.2826 34.5666 45.0170 26.0130 11.5684 17.9800
temp: 298.150 k
press: 1.00000 atm
elementType: 7 7 7 6 6 6 6 6 6 6 6 6 6 6 6 6 6 6 6 6 6 6 6 1 1 1 1 1 1 1 1 1 1 1 1 1 1 1 1 1 1 1 1 1 1 1
symmnumber: 1
zpe: 1006370.2 jmol-1
zpe.correction: 0.383306 hartree
zpe.thermalcorrener: 0.404553 hartree
zpe.thermalcorrenthalpy: 0.405497 hartree
zpe.thermalcorrgfe: 0.331981 hartree
zpe.sumelectzpe: -938.488037 hartree
zpe.sumelectthermal: -938.466791 hartree
zpe.sumelectthermalent: -938.465846 hartree
zpe.sumelectthermalfe: -938.539363 hartree
dipole: -1.7591 -0.7539 3.3982
dipole: 3.9001
quadrupole: -135.3451 -140.3908 -133.9587
quadrupole: -4.6075 13.7961 9.4268
quadrupole: 1.2198 -3.8259 2.6062 -4.6075 13.7961 9.4268
hfenergy: -938.8713435 hartree
pointgroup: C01 [X(C20H23N3)]
dipole: -0.8256746 -0.336566 1.2487654 debye
polarizability: 273.9852371|-14.9469898|200.4172932|19.0460801|-6.9392948|210.0762334 unknown
InChI: InChI=1S/C20H23N3/c1-17-7-5-6-10-19(17)22-20(16-21)11-13-23(14-12-20)15-18-8-3-2-4-9-18/h2-10,22H,11-15H2,1H3
charge 0 multiplicity 1
46 atoms
N  -1.876124 1.02356 0.353487
N  2.296154 0.275694 1.006369
N  1.787171 2.583127 -1.57609
C  1.102414 0.82677 0.350811
C  0.164221 -0.284655 -0.226333
C  0.287031 1.608865 1.430802
C  -1.170718 0.292566 -0.728679
C  -1.050837 2.134936 0.882945
C  -3.227291 1.479997 -0.056765
C  1.479455 1.79649 -0.73245
C  3.3266 -0.485981 0.416074
C  -4.215796 0.334941 -0.256247
C  4.332419 -1.03772 1.279445
C  3.405708 -0.722812 -0.984376
C  -5.170395 0.386456 -1.301133
C  -4.230354 -0.770928 0.631359
C  5.367578 -1.811217 0.710705
C  4.276027 -0.797515 2.778012
C  4.448826 -1.505936 -1.521338
C  -6.131231 -0.639917 -1.452799
C  -5.18563 -1.799919 0.479941
C  5.437158 -2.06006 -0.679951
C  -6.142694 -1.736616 -0.561023
H  -0.024093 -0.993969 0.600103
H  0.662498 -0.837912 -1.039399
H  0.890041 2.452753 1.816706
H  0.087161 0.903028 2.259339
H  -0.990087 0.955136 -1.614025
H  -1.817636 -0.535152 -1.068321
H  -1.60596 2.625747 1.703884
H  -0.851944 2.915622 0.104878
H  2.465026 0.61316 1.954028
H  -3.191759 2.102552 -0.98683
H  -3.60182 2.143142 0.749635
H  2.681372 -0.271325 -1.667571
H  -5.161904 1.232006 -2.000652
H  -3.477483 -0.812362 1.426572
H  6.132062 -2.231743 1.375879
H  4.35804 0.279719 3.035914
H  3.331346 -1.173174 3.220218
H  5.1083 -1.31076 3.287586
H  4.489904 -1.669899 -2.604051
H  -6.863709 -0.586549 -2.266271
H  -5.186357 -2.649946 1.172131
H  6.248591 -2.666969 -1.094476
H  -6.884679 -2.534629 -0.677643
