program: Gaussian 09
title: 000070373
version: EM64L-G09RevD.01
frameworkgroup: C1[X(C9H8N2O5)]
method: RPBEPBE
basis: SDD
operation: Freq
keyword: #pfreq=noraman
keyword: PBEPBE/SDD
title: #p freq=noraman PBEPBE/SDD
converged: YES YES NO NO
title: Mulliken charges:
elementType: O O O O O N N C C C C C C C C C H H H H H H H H
charge: -0.424432 -0.301554 -0.237620 -0.198303 -0.182598 -0.461695 0.022106 0.385504 0.037889 -0.479381 0.428899 -0.269859 -0.398990 0.164284 0.220180 -0.787846 0.365548 0.286782 0.293391 0.382884 0.245986 0.267778 0.243897 0.397151
chargesum: 0.00000
title: Mulliken charges with hydrogens summed into heavy atoms:
elementType: O O O O O N N C C C C C C C C C
charge: -0.027281 -0.301554 -0.237620 -0.198303 -0.182598 -0.078811 0.022106 0.385504 0.037889 -0.113832 0.428899 0.016923 -0.105599 0.164284 0.220180 -0.030185
polarizability: 1.91511795e+02 2.43112905e+00 1.76729281e+02 5.15765840e-03 -8.95617823e-02 5.53377262e+01
1716.lowfreq: -55.9047 -7.4073 -3.9464 -0.0008 -0.0004 0.0006 4.4209 40.2846 56.9233
frequency: -55.9012 40.2766 56.9225 75.8027 85.0170 115.4038 120.1612 172.4270 219.4080 255.0601 283.1185 299.3179 315.5413 324.5709 436.9505 476.2463 488.7950 531.1853 542.9813 559.9901 585.0079 592.0021 627.9381 653.4802 680.8423 712.2132 737.1061 774.1862 774.4009 860.5876 899.8998 905.9834 940.6937 976.3960 998.5830 998.9215 1020.7605 1036.2151 1074.5732 1125.2900 1160.2107 1210.5657 1227.2186 1243.5407 1273.0731 1331.5489 1379.5373 1382.6938 1391.4455 1433.1365 1442.7323 1462.6354 1464.3479 1521.4868 1584.7267 1593.4620 1632.4408 1655.1295 2992.6534 3077.5280 3140.1748 3180.2512 3189.0171 3200.4333 3273.5975 3532.8230
redmass: 1.0440 13.6804 9.1284 6.0935 4.1889 6.6274 7.7396 6.7170 6.0681 8.6758 4.9853 12.1046 4.2836 9.0914 3.3232 7.8732 6.3672 5.6893 4.5362 5.4675 1.5118 2.2641 5.2460 5.8382 4.6574 5.0571 7.5555 5.5476 4.9083 1.5080 1.1540 4.1484 5.3116 1.3927 1.3470 1.9057 5.0074 1.6841 1.9781 1.6314 1.6646 8.1175 4.0907 1.6564 2.1080 2.6870 1.2722 9.1551 8.2151 4.5692 1.3463 1.8586 1.0667 2.8259 7.3528 4.9963 8.0977 2.8489 1.0382 1.0979 1.0987 1.0894 1.0928 1.0970 1.0812 1.0643
irintensity: 0.7051 0.0296 1.3279 0.0076 6.0560 1.1836 1.2062 5.1635 1.2502 3.7616 3.4284 0.7554 0.1755 2.2574 14.6916 16.8940 21.3839 18.6031 2.4601 0.5757 81.5727 28.4112 23.1025 5.7353 50.1175 25.9169 42.4597 8.3940 5.5746 33.2032 89.2724 12.3513 3.1742 36.9642 0.1384 30.8839 277.8098 12.6271 43.0720 165.6928 120.4257 227.7284 78.1418 2.0219 122.4799 278.9070 53.3572 23.6675 122.9166 58.1420 25.8521 64.9792 22.5117 509.9092 78.1919 245.0220 193.0343 3.0378 3.2286 10.3900 7.5088 1.9491 32.9147 1.8610 167.0942 83.2506
temp: 298.150 k
press: 1.00000 atm
elementType: 8 8 8 8 8 7 7 6 6 6 6 6 6 6 6 6 1 1 1 1 1 1 1 1
symmnumber: 1
zpe: 438734.4 jmol-1
zpe.correction: 0.167105 hartree
zpe.thermalcorrener: 0.180869 hartree
zpe.thermalcorrenthalpy: 0.181813 hartree
zpe.thermalcorrgfe: 0.125279 hartree
zpe.sumelectzpe: -832.179660 hartree
zpe.sumelectthermal: -832.165896 hartree
zpe.sumelectthermalent: -832.164952 hartree
zpe.sumelectthermalfe: -832.221486 hartree
dipole: 6.0883 -4.3719 0.0208
dipole: 7.4954
quadrupole: -100.3713 -89.6200 -91.1155
quadrupole: 5.6073 0.0325 0.0090
quadrupole: -6.6690 4.0822 2.5868 5.6073 0.0325 0.0090
hfenergy: -832.3467649 hartree
pointgroup: C01 [X(C9H8N2O5)]
dipole: -2.4638419 1.6186691 0.0735964 debye
dipolederiv: -0.3329777 0.227934 0.0011033 0.3880437 -1.4892702 -0.0197983 0.0023941 -0.0156273 -0.4127594 -1.1268875 0.0117572 0.0146696 -0.0690286 -0.694857 -0.0026066 0.0118748 -0.0043989 -0.3348546 -0.6068779 0.4185739 0.0106788 -0.1372012 -1.0058319 -0.005397 0.0058004 -0.0136165 -0.3244544 -0.8431384 -0.1655573 0.0088851 -0.0558553 -0.5304216 -0.0036165 0.0104262 -0.0015468 -0.2222526 -0.6084275 0.1299375 0.0093531 0.1104835 -0.7039727 -0.0093022 0.008865 -0.0099153 -0.2070504 -0.8212491 -0.7149421 -0.0001995 -0.6886234 -1.9045473 -0.0043357 0.0015438 -0.0034246 -0.3032411 1.6482511 -0.0905689 -0.0280843 -0.2235892 1.1123082 0.0176933 -0.02958 0.0154939 0.1836735 0.8333315 1.1368131 0.0016704 0.3024832 0.601388 0.0008682 -0.0086507 -0.0140378 0.1295558 -0.7191211 0.5572073 0.0194038 0.0668878 -0.3998271 -0.0050516 0.0134901 -0.0141063 -0.0416291 -0.3441136 -0.5904426 -0.0035991 0.0930227 -0.1605533 -0.0021068 0.0056661 0.0102084 -0.125631 -0.3175139 0.3037339 0.0113311 0.173828 0.38542 0.001225 0.009227 -0.0011544 0.0834082 0.162719 -0.3999874 -0.0096217 0.1219442 0.0639205 0.0000508 -0.0024099 0.008845 -0.0778889 -0.1575618 0.2727199 0.0045676 -0.0747195 -0.4001201 -0.0015793 -0.0004308 -0.0083806 -0.1468149 1.6970427 -0.5962849 -0.0331759 -0.4421666 1.7870931 0.0256703 -0.0298021 0.0283698 0.2529795 0.9883949 -0.0653321 -0.0194688 0.6354888 2.2457889 0.0085116 -0.0171 0.0159264 0.1832921 -0.4377507 -0.2645948 0.0105962 -0.1184732 -0.0900792 -0.0001722 0.0221696 0.0110658 0.037835 0.2053789 0.0284814 -0.0001998 0.0585826 0.1872654 -0.0014555 0.0006218 -0.0004722 0.1908867 0.113116 0.0134384 0.0009532 0.0080656 0.01687 -0.0022557 0.0008241 -0.002264 0.1551134 0.0812344 -0.0484598 0.0007814 -0.0299939 0.1029515 -0.0007298 0.0009448 -0.00038 0.1800259 0.2393025 -0.1570734 -0.0005893 -0.0252115 0.3940672 0.0016169 0.000404 0.0035585 0.297631 0.0554869 -0.005212 0.0521611 0.0166532 0.0735398 -0.0832159 0.0784598 -0.0515363 -0.0283664 0.0937209 0.0350034 0.00256 -0.0347957 -0.0763157 -0.0081404 -0.0030628 -0.011729 0.1326825 0.0455631 0.0046462 -0.0578653 0.0322374 0.0605419 0.0919031 -0.0852034 0.0585407 -0.0068786 0.1520774 -0.0417909 0.0040892 -0.1080625 0.4246415 0.0022242 0.0035283 0.0005816 0.4047377 unknown
polarizability: 191.2384354|3.0656165|176.9367262|-2.4916801|1.5143543|55.4036404 unknown
InChI: InChI=1S/C9H8N2O5/c1-5(12)10-8-4-6(11(15)16)2-3-7(8)9(13)14/h2-4,10,13H,1H3
charge 0 multiplicity 1
24 atoms
O  -2.07674 3.257791 0.094054
O  -3.152945 1.214426 0.087805
O  -0.646951 -3.12682 -0.00855
O  4.252009 0.523368 -0.052932
O  3.414738 -1.596243 -0.069189
N  -1.639173 -0.98946 0.03074
N  3.27321 -0.31767 -0.047478
C  -0.516063 -0.147355 0.022301
C  -0.705571 1.284307 0.04657
C  0.812232 -0.661416 -0.009405
C  1.885592 0.239987 -0.014199
C  0.422866 2.148957 0.040473
C  1.729224 1.644857 0.01044
C  -2.0635 1.866394 0.078155
C  -1.676687 -2.397507 0.018782
C  -3.093929 -2.957978 0.045421
H  0.981973 -1.73961 -0.028832
H  0.246513 3.22695 0.059701
H  2.606886 2.293989 0.006256
H  -2.542303 -0.480051 0.05517
H  -3.618227 -2.663777 0.973289
H  -3.042104 -4.054696 -0.003344
H  -3.687463 -2.585125 -0.809322
H  -3.019687 3.573583 0.114793
